{"text_format":"1","workbook":"xlsx","n_sheets":5,"sheets":["OK","KO","Lidé","Lidé_OE","Lidé_HNIM"],"not_rendered":{"charts":0,"images":0,"macros":0,"external_links":0,"defined_names":5,"comments":0,"pivot_tables":0},"unopened":[],"bounds":{"document_bytes":16777216,"sheet_cells":100000,"rows_first":2000,"rows_last":500,"rows_between":2000,"halvings":0,"cell_chars":16384,"cell_head_chars":4096},"cells_cut":0,"cells_raw":0,"read":"whole","date_system":"1900"}

{"sheet":"OK","index":0,"n_rows":5,"n_cols":2,"rows_kept":5,"cut":false,"hidden":false,"merged":[[0,3,0,5],[1,1,1,5],[2,1,2,3],[3,1,3,5],[4,1,4,3]]}
[]
[]
[null,"ka"]
[]
[null,"petro"]

{"sheet":"KO","index":1,"n_rows":5,"n_cols":2,"rows_kept":5,"cut":false,"hidden":false,"merged":[[0,3,0,5],[1,0,1,5],[2,1,2,3],[3,0,3,5],[4,1,4,3]]}
[]
[]
[null,"Julie"]
[]
[null,"m"]

{"sheet":"Lidé","index":2,"n_rows":9,"n_cols":10,"rows_kept":9,"cut":false,"hidden":false,"merged":[]}
["Jméno","Os. Číslo",null,null,"OK B5",null,null,null,"KO B5"]
["Karel",1,null,{"$f":"IF(ISNUMBER(SEARCH(OK!$B$5,A2)),MAX($D$1:$D1)+1,0)","v":0},{"$f":"_xlfn.IFNA(INDEX($A2:$A$9,MATCH(ROWS($D$2:$D2),$D2:$D$9,0)),\"\")","v":"Petronela"},{"$f":"_xlfn.IFNA(VLOOKUP(ROWS($D$2:$D2),D2:$E$9,2,FALSE),\"\")","v":""},null,{"$f":"IF(ISNUMBER(SEARCH(KO!$B$5,A2)),MAX($H$1:$H1)+1,0)","v":0},{"$f":"_xlfn.IFNA(INDEX($A2:$A$9,MATCH(ROWS($H$2:$H2),$H2:$H$9,0)),\"\")","v":"Mirek"},{"$f":"_xlfn.IFNA(VLOOKUP(ROWS($H$2:$H2),H2:$I$9,2,FALSE),\"\")","v":""}]
["Petr",2,null,{"$f":"IF(ISNUMBER(SEARCH(OK!$B$5,A3)),MAX($D$1:$D2)+1,0)","v":0},{"$f":"_xlfn.IFNA(INDEX($A3:$A$9,MATCH(ROWS($D$2:$D3),$D3:$D$9,0)),\"\")","v":""},{"$f":"_xlfn.IFNA(VLOOKUP(ROWS($D$2:$D3),D3:$E$9,2,FALSE),\"\")","v":""},null,{"$f":"IF(ISNUMBER(SEARCH(KO!$B$5,A3)),MAX($H$1:$H2)+1,0)","v":0},{"$f":"_xlfn.IFNA(INDEX($A3:$A$9,MATCH(ROWS($H$2:$H3),$H3:$H$9,0)),\"\")","v":""},{"$f":"_xlfn.IFNA(VLOOKUP(ROWS($H$2:$H3),H3:$I$9,2,FALSE),\"\")","v":""}]
["Mirek",3,null,{"$f":"IF(ISNUMBER(SEARCH(OK!$B$5,A4)),MAX($D$1:$D3)+1,0)","v":0},{"$f":"_xlfn.IFNA(INDEX($A4:$A$9,MATCH(ROWS($D$2:$D4),$D4:$D$9,0)),\"\")","v":""},{"$f":"_xlfn.IFNA(VLOOKUP(ROWS($D$2:$D4),D4:$E$9,2,FALSE),\"\")","v":""},null,{"$f":"IF(ISNUMBER(SEARCH(KO!$B$5,A4)),MAX($H$1:$H3)+1,0)","v":1},{"$f":"_xlfn.IFNA(INDEX($A4:$A$9,MATCH(ROWS($H$2:$H4),$H4:$H$9,0)),\"\")","v":""},{"$f":"_xlfn.IFNA(VLOOKUP(ROWS($H$2:$H4),H4:$I$9,2,FALSE),\"\")","v":""}]
["Petronela",4,null,{"$f":"IF(ISNUMBER(SEARCH(OK!$B$5,A5)),MAX($D$1:$D4)+1,0)","v":1},{"$f":"_xlfn.IFNA(INDEX($A5:$A$9,MATCH(ROWS($D$2:$D5),$D5:$D$9,0)),\"\")","v":""},{"$f":"_xlfn.IFNA(VLOOKUP(ROWS($D$2:$D5),D5:$E$9,2,FALSE),\"\")","v":""},null,{"$f":"IF(ISNUMBER(SEARCH(KO!$B$5,A5)),MAX($H$1:$H4)+1,0)","v":0},{"$f":"_xlfn.IFNA(INDEX($A5:$A$9,MATCH(ROWS($H$2:$H5),$H5:$H$9,0)),\"\")","v":""},{"$f":"_xlfn.IFNA(VLOOKUP(ROWS($H$2:$H5),H5:$I$9,2,FALSE),\"\")","v":""}]
["Julie",5,null,{"$f":"IF(ISNUMBER(SEARCH(OK!$B$5,A6)),MAX($D$1:$D5)+1,0)","v":0},{"$f":"_xlfn.IFNA(INDEX($A6:$A$9,MATCH(ROWS($D$2:$D6),$D6:$D$9,0)),\"\")","v":""},{"$f":"_xlfn.IFNA(VLOOKUP(ROWS($D$2:$D6),D6:$E$9,2,FALSE),\"\")","v":""},null,{"$f":"IF(ISNUMBER(SEARCH(KO!$B$5,A6)),MAX($H$1:$H5)+1,0)","v":0},{"$f":"_xlfn.IFNA(INDEX($A6:$A$9,MATCH(ROWS($H$2:$H6),$H6:$H$9,0)),\"\")","v":""},{"$f":"_xlfn.IFNA(VLOOKUP(ROWS($H$2:$H6),H6:$I$9,2,FALSE),\"\")","v":""}]
["Karolína",6,null,{"$f":"IF(ISNUMBER(SEARCH(OK!$B$5,A7)),MAX($D$1:$D6)+1,0)","v":0},{"$f":"_xlfn.IFNA(INDEX($A7:$A$9,MATCH(ROWS($D$2:$D7),$D7:$D$9,0)),\"\")","v":""},{"$f":"_xlfn.IFNA(VLOOKUP(ROWS($D$2:$D7),D7:$E$9,2,FALSE),\"\")","v":""},null,{"$f":"IF(ISNUMBER(SEARCH(KO!$B$5,A7)),MAX($H$1:$H6)+1,0)","v":0},{"$f":"_xlfn.IFNA(INDEX($A7:$A$9,MATCH(ROWS($H$2:$H7),$H7:$H$9,0)),\"\")","v":""},{"$f":"_xlfn.IFNA(VLOOKUP(ROWS($H$2:$H7),H7:$I$9,2,FALSE),\"\")","v":""}]
[null,null,null,{"$f":"IF(ISNUMBER(SEARCH(OK!$B$5,A8)),MAX($D$1:$D7)+1,0)","v":0},{"$f":"_xlfn.IFNA(INDEX($A8:$A$9,MATCH(ROWS($D$2:$D8),$D8:$D$9,0)),\"\")","v":""},{"$f":"_xlfn.IFNA(VLOOKUP(ROWS($D$2:$D8),D8:$E$9,2,FALSE),\"\")","v":""},null,{"$f":"IF(ISNUMBER(SEARCH(KO!$B$5,A8)),MAX($H$1:$H7)+1,0)","v":0},{"$f":"_xlfn.IFNA(INDEX($A8:$A$9,MATCH(ROWS($H$2:$H8),$H8:$H$9,0)),\"\")","v":""},{"$f":"_xlfn.IFNA(VLOOKUP(ROWS($H$2:$H8),H8:$I$9,2,FALSE),\"\")","v":""}]
[null,null,null,{"$f":"IF(ISNUMBER(SEARCH(OK!$B$5,A9)),MAX($D$1:$D8)+1,0)","v":0},{"$f":"_xlfn.IFNA(INDEX($A9:$A$9,MATCH(ROWS($D$2:$D9),$D9:$D$9,0)),\"\")","v":""},{"$f":"_xlfn.IFNA(VLOOKUP(ROWS($D$2:$D9),D9:$E$9,2,FALSE),\"\")","v":""},null,{"$f":"IF(ISNUMBER(SEARCH(KO!$B$5,A9)),MAX($H$1:$H8)+1,0)","v":0},{"$f":"_xlfn.IFNA(INDEX($A9:$A$9,MATCH(ROWS($H$2:$H9),$H9:$H$9,0)),\"\")","v":""},{"$f":"_xlfn.IFNA(VLOOKUP(ROWS($H$2:$H9),H9:$I$9,2,FALSE),\"\")","v":""}]

{"sheet":"Lidé_OE","index":3,"n_rows":9,"n_cols":6,"rows_kept":9,"cut":false,"hidden":false,"merged":[]}
["Jméno","Os. Číslo",null,null,null,"OK B3"]
["Karel",1,null,null,{"$f":"IF(ISNUMBER(SEARCH(OK!$B$3,A2)),MAX($E$1:$E1)+1,0)","v":1},{"$f":"_xlfn.IFNA(INDEX($A2:$A$9,MATCH(ROWS($E$2:$E2),$E2:$E$9,0)),\"\")","v":"Karel"}]
["Petr",2,null,null,{"$f":"IF(ISNUMBER(SEARCH(OK!$B$3,A3)),MAX($E$1:$E2)+1,0)","v":0},{"$f":"_xlfn.IFNA(INDEX($A3:$A$9,MATCH(ROWS($E$2:$E3),$E3:$E$9,0)),\"\")","v":"Karolína"}]
["Mirek",3,null,null,{"$f":"IF(ISNUMBER(SEARCH(OK!$B$3,A4)),MAX($E$1:$E3)+1,0)","v":0},{"$f":"_xlfn.IFNA(INDEX($A4:$A$9,MATCH(ROWS($E$2:$E4),$E4:$E$9,0)),\"\")","v":""}]
["Petronela",4,null,null,{"$f":"IF(ISNUMBER(SEARCH(OK!$B$3,A5)),MAX($E$1:$E4)+1,0)","v":0},{"$f":"_xlfn.IFNA(INDEX($A5:$A$9,MATCH(ROWS($E$2:$E5),$E5:$E$9,0)),\"\")","v":""}]
["Julie",5,null,null,{"$f":"IF(ISNUMBER(SEARCH(OK!$B$3,A6)),MAX($E$1:$E5)+1,0)","v":0},{"$f":"_xlfn.IFNA(INDEX($A6:$A$9,MATCH(ROWS($E$2:$E6),$E6:$E$9,0)),\"\")","v":""}]
["Karolína",6,null,null,{"$f":"IF(ISNUMBER(SEARCH(OK!$B$3,A7)),MAX($E$1:$E6)+1,0)","v":2},{"$f":"_xlfn.IFNA(INDEX($A7:$A$9,MATCH(ROWS($E$2:$E7),$E7:$E$9,0)),\"\")","v":""}]
[null,null,null,null,{"$f":"IF(ISNUMBER(SEARCH(OK!$B$3,A8)),MAX($E$1:$E7)+1,0)","v":0},{"$f":"_xlfn.IFNA(INDEX($A8:$A$9,MATCH(ROWS($E$2:$E8),$E8:$E$9,0)),\"\")","v":""}]
[null,null,null,null,{"$f":"IF(ISNUMBER(SEARCH(OK!$B$3,A9)),MAX($E$1:$E8)+1,0)","v":0},{"$f":"_xlfn.IFNA(INDEX($A9:$A$9,MATCH(ROWS($E$2:$E9),$E9:$E$9,0)),\"\")","v":""}]

{"sheet":"Lidé_HNIM","index":4,"n_rows":9,"n_cols":5,"rows_kept":9,"cut":false,"hidden":false,"merged":[]}
["Jméno","Os. Číslo",null,null,"KO B3"]
["Karel",1,null,{"$f":"IF(ISNUMBER(SEARCH(KO!$B$3,A2)),MAX($D$1:$D1)+1,0)","v":0},{"$f":"_xlfn.IFNA(INDEX($A2:$A$9,MATCH(ROWS($D$2:$D2),$D2:$D$9,0)),\"\")","v":"Julie"}]
["Petr",2,null,{"$f":"IF(ISNUMBER(SEARCH(KO!$B$3,A3)),MAX($D$1:$D2)+1,0)","v":0},{"$f":"_xlfn.IFNA(INDEX($A3:$A$9,MATCH(ROWS($D$2:$D3),$D3:$D$9,0)),\"\")","v":""}]
["Mirek",3,null,{"$f":"IF(ISNUMBER(SEARCH(KO!$B$3,A4)),MAX($D$1:$D3)+1,0)","v":0},{"$f":"_xlfn.IFNA(INDEX($A4:$A$9,MATCH(ROWS($D$2:$D4),$D4:$D$9,0)),\"\")","v":""}]
["Petronela",4,null,{"$f":"IF(ISNUMBER(SEARCH(KO!$B$3,A5)),MAX($D$1:$D4)+1,0)","v":0},{"$f":"_xlfn.IFNA(INDEX($A5:$A$9,MATCH(ROWS($D$2:$D5),$D5:$D$9,0)),\"\")","v":""}]
["Julie",5,null,{"$f":"IF(ISNUMBER(SEARCH(KO!$B$3,A6)),MAX($D$1:$D5)+1,0)","v":1},{"$f":"_xlfn.IFNA(INDEX($A6:$A$9,MATCH(ROWS($D$2:$D6),$D6:$D$9,0)),\"\")","v":""}]
["Karolína",6,null,{"$f":"IF(ISNUMBER(SEARCH(KO!$B$3,A7)),MAX($D$1:$D6)+1,0)","v":0},{"$f":"_xlfn.IFNA(INDEX($A7:$A$9,MATCH(ROWS($D$2:$D7),$D7:$D$9,0)),\"\")","v":""}]
[null,null,null,{"$f":"IF(ISNUMBER(SEARCH(KO!$B$3,A8)),MAX($D$1:$D7)+1,0)","v":0},{"$f":"_xlfn.IFNA(INDEX($A8:$A$9,MATCH(ROWS($D$2:$D8),$D8:$D$9,0)),\"\")","v":""}]
[null,null,null,{"$f":"IF(ISNUMBER(SEARCH(KO!$B$3,A9)),MAX($D$1:$D8)+1,0)","v":0},{"$f":"_xlfn.IFNA(INDEX($A9:$A$9,MATCH(ROWS($D$2:$D9),$D9:$D$9,0)),\"\")","v":""}]