{"text_format":"1","workbook":"xlsx","n_sheets":5,"sheets":["OK","KO","Lidé","Lidé_OE","Lidé_HNIM"],"not_rendered":{"charts":0,"images":0,"macros":0,"external_links":0,"defined_names":5,"comments":0,"pivot_tables":0},"unopened":[],"bounds":{"document_bytes":16777216,"sheet_cells":100000,"rows_first":2000,"rows_last":500,"rows_between":2000,"halvings":0,"cell_chars":16384,"cell_head_chars":4096},"cells_cut":0,"cells_raw":0,"read":"whole","date_system":"1900"}

{"sheet":"OK","index":0,"n_rows":5,"n_cols":8,"rows_kept":5,"cut":false,"hidden":false,"merged":[[0,3,0,5],[1,1,1,5],[2,1,2,3],[3,1,3,5],[4,1,4,3]]}
[]
[]
[null,null,null,null,null,null,"B","=OFFSET(Lidé_OE!$G$2;;;COUNTIF(Lidé_OE!F2:F9;\"?*\"))"]
[null,null,null,null,null,null,"C","=OFFSET(Lidé_OE!$G$2;;;COUNTIF(Lidé_OE!G2:G9;\"?*\"))"]
[null,null,null,null,null,null,"D","=OFFSET(Lidé_OE!$G$2;;;COUNTIF(Lidé_OE!#ODKAZ!;\"?*\"))"]

{"sheet":"KO","index":1,"n_rows":5,"n_cols":8,"rows_kept":5,"cut":false,"hidden":false,"merged":[[0,3,0,5],[1,0,1,5],[2,1,2,3],[3,0,3,5],[4,1,4,3]]}
[]
[]
[null,null,null,null,null,null,"B","=OFFSET(Lidé_HNIM!$F$2;;;COUNTIF(Lidé_HNIM!E2:E8;\"?*\"))"]
[null,null,null,null,null,null,"C","=OFFSET(Lidé_HNIM!$F$2;;;COUNTIF(Lidé_HNIM!F2:F8;\"?*\"))"]
[null,null,null,null,null,null,"D","=OFFSET(Lidé_HNIM!$F$2;;;COUNTIF(Lidé_HNIM!G2:G8;\"?*\"))"]

{"sheet":"Lidé","index":2,"n_rows":9,"n_cols":10,"rows_kept":9,"cut":false,"hidden":false,"merged":[]}
["Jméno","Os. Číslo"]
["Karel",1,null,{"$f":"IF(ISNUMBER(SEARCH(OK!$B$5,E2)),MAX($D$1:$D1)+1,0)","v":1},{"$f":"A2","v":"Karel"},{"$f":"_xlfn.IFNA(VLOOKUP(ROWS($D$2:$D2),D2:$E$9,2,FALSE),\"\")","v":"Karel"},null,{"$f":"IF(ISNUMBER(SEARCH(KO!$B$5,I2)),MAX($H$1:$H1)+1,0)","v":1},{"$f":"A2","v":"Karel"},{"$f":"_xlfn.IFNA(VLOOKUP(ROWS($H$2:$H2),H2:$I$9,2,FALSE),\"\")","v":"Karel"}]
["Petr",2,null,{"$f":"IF(ISNUMBER(SEARCH(OK!$B$5,E3)),MAX($D$1:$D2)+1,0)","v":2},{"$f":"A3","v":"Petr"},{"$f":"_xlfn.IFNA(VLOOKUP(ROWS($D$2:$D3),D3:$E$9,2,FALSE),\"\")","v":"Petr"},null,{"$f":"IF(ISNUMBER(SEARCH(KO!$B$5,I3)),MAX($H$1:$H2)+1,0)","v":2},{"$f":"A3","v":"Petr"},{"$f":"_xlfn.IFNA(VLOOKUP(ROWS($H$2:$H3),H3:$I$9,2,FALSE),\"\")","v":"Petr"}]
["Mirek",3,null,{"$f":"IF(ISNUMBER(SEARCH(OK!$B$5,E4)),MAX($D$1:$D3)+1,0)","v":3},"Mirek",{"$f":"_xlfn.IFNA(VLOOKUP(ROWS($D$2:$D4),D4:$E$9,2,FALSE),\"\")","v":"Mirek"},null,{"$f":"IF(ISNUMBER(SEARCH(KO!$B$5,I4)),MAX($H$1:$H3)+1,0)","v":3},"Mirek",{"$f":"_xlfn.IFNA(VLOOKUP(ROWS($H$2:$H4),H4:$I$9,2,FALSE),\"\")","v":"Mirek"}]
["Petronela",4,null,{"$f":"IF(ISNUMBER(SEARCH(OK!$B$5,E5)),MAX($D$1:$D4)+1,0)","v":4},"Petronela",{"$f":"_xlfn.IFNA(VLOOKUP(ROWS($D$2:$D5),D5:$E$9,2,FALSE),\"\")","v":"Petronela"},null,{"$f":"IF(ISNUMBER(SEARCH(KO!$B$5,I5)),MAX($H$1:$H4)+1,0)","v":4},"Petronela",{"$f":"_xlfn.IFNA(VLOOKUP(ROWS($H$2:$H5),H5:$I$9,2,FALSE),\"\")","v":"Petronela"}]
["Julie",5,null,{"$f":"IF(ISNUMBER(SEARCH(OK!$B$5,E6)),MAX($D$1:$D5)+1,0)","v":5},"Julie",{"$f":"_xlfn.IFNA(VLOOKUP(ROWS($D$2:$D6),D6:$E$9,2,FALSE),\"\")","v":"Julie"},null,{"$f":"IF(ISNUMBER(SEARCH(KO!$B$5,I6)),MAX($H$1:$H5)+1,0)","v":5},"Julie",{"$f":"_xlfn.IFNA(VLOOKUP(ROWS($H$2:$H6),H6:$I$9,2,FALSE),\"\")","v":"Julie"}]
["Karolína",6,null,{"$f":"IF(ISNUMBER(SEARCH(OK!$B$5,E7)),MAX($D$1:$D6)+1,0)","v":6},"Karolína",{"$f":"_xlfn.IFNA(VLOOKUP(ROWS($D$2:$D7),D7:$E$9,2,FALSE),\"\")","v":"Karolína"},null,{"$f":"IF(ISNUMBER(SEARCH(KO!$B$5,I7)),MAX($H$1:$H6)+1,0)","v":6},"Karolína",{"$f":"_xlfn.IFNA(VLOOKUP(ROWS($H$2:$H7),H7:$I$9,2,FALSE),\"\")","v":"Karolína"}]
[null,null,null,null,0,{"$f":"_xlfn.IFNA(VLOOKUP(ROWS($D$2:$D8),D8:$E$9,2,FALSE),\"\")","v":""},null,{"$f":"IF(ISNUMBER(SEARCH(KO!$B$5,I8)),MAX($H$1:$H7)+1,0)","v":7},0,{"$f":"_xlfn.IFNA(VLOOKUP(ROWS($H$2:$H8),H8:$I$9,2,FALSE),\"\")","v":0}]
[null,null,null,null,0,{"$f":"_xlfn.IFNA(VLOOKUP(ROWS($D$2:$D9),D9:$E$9,2,FALSE),\"\")","v":""},null,{"$f":"IF(ISNUMBER(SEARCH(KO!$B$5,I9)),MAX($H$1:$H8)+1,0)","v":8},0,{"$f":"_xlfn.IFNA(VLOOKUP(ROWS($H$2:$H9),H9:$I$9,2,FALSE),\"\")","v":0}]

{"sheet":"Lidé_OE","index":3,"n_rows":9,"n_cols":7,"rows_kept":9,"cut":false,"hidden":false,"merged":[]}
["Jméno","Os. Číslo"]
["Karel",1,null,null,{"$f":"IF(ISNUMBER(SEARCH(OK!$B$3,F2)),MAX($E$1:$E1)+1,0)","v":1},{"$f":"A2","v":"Karel"},{"$f":"_xlfn.IFNA(VLOOKUP(ROWS($E$2:$E2),E2:$F$9,2,FALSE),\"\")","v":"Karel"}]
["Petr",2,null,null,{"$f":"IF(ISNUMBER(SEARCH(OK!$B$3,F3)),MAX($E$1:$E2)+1,0)","v":2},"Petr",{"$f":"_xlfn.IFNA(VLOOKUP(ROWS($E$2:$E3),E3:$F$9,2,FALSE),\"\")","v":"Petr"}]
["Mirek",3,null,null,{"$f":"IF(ISNUMBER(SEARCH(OK!$B$3,F4)),MAX($E$1:$E3)+1,0)","v":3},"Mirek",{"$f":"_xlfn.IFNA(VLOOKUP(ROWS($E$2:$E4),E4:$F$9,2,FALSE),\"\")","v":"Mirek"}]
["Petronela",4,null,null,{"$f":"IF(ISNUMBER(SEARCH(OK!$B$3,F5)),MAX($E$1:$E4)+1,0)","v":4},"Petronela",{"$f":"_xlfn.IFNA(VLOOKUP(ROWS($E$2:$E5),E5:$F$9,2,FALSE),\"\")","v":"Petronela"}]
["Julie",5,null,null,{"$f":"IF(ISNUMBER(SEARCH(OK!$B$3,F6)),MAX($E$1:$E5)+1,0)","v":5},"Julie",{"$f":"_xlfn.IFNA(VLOOKUP(ROWS($E$2:$E6),E6:$F$9,2,FALSE),\"\")","v":"Julie"}]
["Karolína",6,null,null,{"$f":"IF(ISNUMBER(SEARCH(OK!$B$3,F7)),MAX($E$1:$E6)+1,0)","v":6},"Karolína",{"$f":"_xlfn.IFNA(VLOOKUP(ROWS($E$2:$E7),E7:$F$9,2,FALSE),\"\")","v":"Karolína"}]
[null,null,null,null,{"$f":"IF(ISNUMBER(SEARCH(OK!$B$3,F8)),MAX($E$1:$E7)+1,0)","v":7},0,{"$f":"_xlfn.IFNA(VLOOKUP(ROWS($E$2:$E8),E8:$F$9,2,FALSE),\"\")","v":0}]
[null,null,null,null,{"$f":"IF(ISNUMBER(SEARCH(OK!$B$3,F9)),MAX($E$1:$E8)+1,0)","v":8},0,{"$f":"_xlfn.IFNA(VLOOKUP(ROWS($E$2:$E9),E9:$F$9,2,FALSE),\"\")","v":0}]

{"sheet":"Lidé_HNIM","index":4,"n_rows":8,"n_cols":14,"rows_kept":8,"cut":false,"hidden":false,"merged":[]}
["Jméno","Os. Číslo"]
["Karel",1,null,{"$f":"IF(ISNUMBER(SEARCH(KO!$B$3,E2)),MAX($D$1:$D1)+1,0)","v":1},{"$f":"A2","v":"Karel"},{"$f":"_xlfn.IFNA(VLOOKUP(ROWS($D$2:$D2),D2:$E$8,2,FALSE),\"\")","v":"Karel"},null,{"$f":"IF(ISNUMBER(SEARCH(#REF!,I2)),MAX($H$1:$H1)+1,0)","v":0},{"$f":"A2","v":"Karel"},{"$f":"_xlfn.IFNA(VLOOKUP(ROWS($H$2:$H2),H2:$I$8,2,FALSE),\"\")","v":""},null,{"$f":"IF(ISNUMBER(SEARCH(#REF!,M2)),MAX($L$1:$L1)+1,0)","v":0},{"$f":"A2","v":"Karel"},{"$f":"_xlfn.IFNA(VLOOKUP(ROWS($L$2:$L2),L2:$M$8,2,FALSE),\"\")","v":""}]
["Petr",2,null,{"$f":"IF(ISNUMBER(SEARCH(KO!$B$3,E3)),MAX($D$1:$D2)+1,0)","v":2},{"$f":"A3","v":"Petr"},{"$f":"_xlfn.IFNA(VLOOKUP(ROWS($D$2:$D3),D3:$E$8,2,FALSE),\"\")","v":"Petr"},null,{"$f":"IF(ISNUMBER(SEARCH(#REF!,I3)),MAX($H$1:$H2)+1,0)","v":0},{"$f":"A3","v":"Petr"},{"$f":"_xlfn.IFNA(VLOOKUP(ROWS($H$2:$H3),H3:$I$8,2,FALSE),\"\")","v":""},null,{"$f":"IF(ISNUMBER(SEARCH(#REF!,M3)),MAX($L$1:$L2)+1,0)","v":0},{"$f":"A3","v":"Petr"},{"$f":"_xlfn.IFNA(VLOOKUP(ROWS($L$2:$L3),L3:$M$8,2,FALSE),\"\")","v":""}]
["Mirek",3,null,{"$f":"IF(ISNUMBER(SEARCH(KO!$B$3,E4)),MAX($D$1:$D3)+1,0)","v":3},"Mirek",{"$f":"_xlfn.IFNA(VLOOKUP(ROWS($D$2:$D4),D4:$E$8,2,FALSE),\"\")","v":"Mirek"},null,{"$f":"IF(ISNUMBER(SEARCH(#REF!,I4)),MAX($H$1:$H3)+1,0)","v":0},"Mirek",{"$f":"_xlfn.IFNA(VLOOKUP(ROWS($H$2:$H4),H4:$I$8,2,FALSE),\"\")","v":""},null,{"$f":"IF(ISNUMBER(SEARCH(#REF!,M4)),MAX($L$1:$L3)+1,0)","v":0},"Mirek",{"$f":"_xlfn.IFNA(VLOOKUP(ROWS($L$2:$L4),L4:$M$8,2,FALSE),\"\")","v":""}]
["Petronela",4,null,{"$f":"IF(ISNUMBER(SEARCH(KO!$B$3,E5)),MAX($D$1:$D4)+1,0)","v":4},"Petronela",{"$f":"_xlfn.IFNA(VLOOKUP(ROWS($D$2:$D5),D5:$E$8,2,FALSE),\"\")","v":"Petronela"},null,{"$f":"IF(ISNUMBER(SEARCH(#REF!,I5)),MAX($H$1:$H4)+1,0)","v":0},"Petronela",{"$f":"_xlfn.IFNA(VLOOKUP(ROWS($H$2:$H5),H5:$I$8,2,FALSE),\"\")","v":""},null,{"$f":"IF(ISNUMBER(SEARCH(#REF!,M5)),MAX($L$1:$L4)+1,0)","v":0},"Petronela",{"$f":"_xlfn.IFNA(VLOOKUP(ROWS($L$2:$L5),L5:$M$8,2,FALSE),\"\")","v":""}]
["Julie",5,null,{"$f":"IF(ISNUMBER(SEARCH(KO!$B$3,E6)),MAX($D$1:$D5)+1,0)","v":5},"Julie",{"$f":"_xlfn.IFNA(VLOOKUP(ROWS($D$2:$D6),D6:$E$8,2,FALSE),\"\")","v":"Julie"},null,{"$f":"IF(ISNUMBER(SEARCH(#REF!,I6)),MAX($H$1:$H5)+1,0)","v":0},"Julie",{"$f":"_xlfn.IFNA(VLOOKUP(ROWS($H$2:$H6),H6:$I$8,2,FALSE),\"\")","v":""},null,{"$f":"IF(ISNUMBER(SEARCH(#REF!,M6)),MAX($L$1:$L5)+1,0)","v":0},"Julie",{"$f":"_xlfn.IFNA(VLOOKUP(ROWS($L$2:$L6),L6:$M$8,2,FALSE),\"\")","v":""}]
["Karolína",6,null,{"$f":"IF(ISNUMBER(SEARCH(KO!$B$3,E7)),MAX($D$1:$D6)+1,0)","v":6},"Karolína",{"$f":"_xlfn.IFNA(VLOOKUP(ROWS($D$2:$D7),D7:$E$8,2,FALSE),\"\")","v":"Karolína"},null,{"$f":"IF(ISNUMBER(SEARCH(#REF!,I7)),MAX($H$1:$H6)+1,0)","v":0},"Karolína",{"$f":"_xlfn.IFNA(VLOOKUP(ROWS($H$2:$H7),H7:$I$8,2,FALSE),\"\")","v":""},null,{"$f":"IF(ISNUMBER(SEARCH(#REF!,M7)),MAX($L$1:$L6)+1,0)","v":0},"Karolína",{"$f":"_xlfn.IFNA(VLOOKUP(ROWS($L$2:$L7),L7:$M$8,2,FALSE),\"\")","v":""}]
[null,null,null,{"$f":"IF(ISNUMBER(SEARCH(KO!$B$3,E8)),MAX($D$1:$D7)+1,0)","v":7},0,{"$f":"_xlfn.IFNA(VLOOKUP(ROWS($D$2:$D8),D8:$E$8,2,FALSE),\"\")","v":0},null,{"$f":"IF(ISNUMBER(SEARCH(#REF!,I8)),MAX($H$1:$H7)+1,0)","v":0},0,{"$f":"_xlfn.IFNA(VLOOKUP(ROWS($H$2:$H8),H8:$I$8,2,FALSE),\"\")","v":""},null,{"$f":"IF(ISNUMBER(SEARCH(#REF!,M8)),MAX($L$1:$L7)+1,0)","v":0},0,{"$f":"_xlfn.IFNA(VLOOKUP(ROWS($L$2:$L8),L8:$M$8,2,FALSE),\"\")","v":""}]