{"text_format":"1","workbook":"xlsx","n_sheets":3,"sheets":["Grupo Antoline","Databáza","Materiál"],"not_rendered":{"charts":0,"images":0,"macros":1,"external_links":0,"defined_names":0,"comments":0,"pivot_tables":0},"unopened":[],"bounds":{"document_bytes":16777216,"sheet_cells":100000,"rows_first":2000,"rows_last":500,"rows_between":2000,"halvings":0,"cell_chars":16384,"cell_head_chars":4096},"cells_cut":0,"cells_raw":0,"read":"whole","date_system":"1900"}

{"sheet":"Grupo Antoline","index":0,"n_rows":176,"n_cols":67,"rows_kept":176,"cut":false,"hidden":false,"merged":[[2,10,2,13],[4,0,4,1],[4,2,4,6],[4,7,4,9],[4,10,4,13],[0,61,5,63],[0,27,6,27],[0,28,6,28],[0,29,6,29],[0,30,6,30],[0,31,5,60],[0,26,6,26],[0,0,0,13],[0,14,6,14],[0,15,6,15],[0,16,6,16],[0,17,4,19],[0,20,6,20],[1,0,1,13],[2,0,2,1],[2,2,2,6],[2,7,2,9],[0,21,6,21],[0,22,6,22],[0,23,6,23],[0,24,6,24],[0,25,6,25]]}
["GRUPO ANTOLINE",null,null,null,null,null,null,null,null,null,null,null,null,null,"KONTROLOVANÉ PARAMETRE","Skladové čislo podľa systému","Označenie, Výrobca, Typ","Základné rozmery podľa výkresu",null,null,"Kritické rozmery podľa výkresu (iba ak sú určené)","Vizuálna kontrola kvality, povrchová úprava, poškodenia, chyby","Kontrola hodnoty vizuálne, čiarový resp. iný kód výrobcu, watáž, voltáž","Kontrola hodnoty meraním, tolerancia,","Doba použiteľnosti","Rozteč vývodov, Tvarovanie vývodov","Priemer dier, predrez","Revízia, LOT","Skúška zmontovania vrchného krytu zo spodným","Zákzanícka potlač (Umiestnenie a kvalita)","BEZPEČNOSTNÝ PRVOK","Merania elektrických parametrov súčiastok",null,null,null,null,null,null,null,null,null,null,null,null,null,null,null,null,null,null,null,null,null,null,null,null,null,null,null,null,null,"Merania základných rozmerov "]
["VSTUPNÁ KONTROLA  -  protokol"]
["UVOĽNENÉ",null,"UPOZORNENIE",null,null,null,null,"REKLAMÁCIE",null,null,"KONTROL. POLOŽKY"]
[]
[{"$f":"SUMIF($L8:$L469,\"UVOĽNENÉ\",$K8:$K469)","v":5},null,{"$f":"SUMIF($L8:$L469,\"UPOZORNENIE\",$K8:$K469)/2+SUMIF($L8:$L469,\"UPOZOR. / NÁKL.\",$K8:$K469)/3","v":0},null,null,null,null,{"$f":"SUMIF($L8:$L469,\"REKLAMÁCIA\",$K8:$K469)/4","v":0},null,null,{"$f":"A5+C5+H5","v":5}]
[]
["Dátum"," JK","Druh mater.","Lot number","Hodn.","Jednotka","Tol.\n%","Dod. množstvo","Dodávateľ","Výber","Výsledok","Rozhodnutie","Kontroloval","Dodací list č.",null,null,null,"Výška","Šírka","Hĺbka",null,null,null,null,null,null,null,null,null,null,null,1,2,3,4,5,6,7,8,9,10,11,12,13,14,15,16,17,18,19,20,21,22,23,24,25,26,27,28,29,30,"Výška","Šírka","Hĺbka"]
["2021-01-04","GA70-000002","Rigid, FR4, 1.0mm, 2 Layers, 730.9 x 10.4 mm",null,{"$f":"VLOOKUP(B8,Materiál!B:J,3,FALSE)","v":"BMW I20 Front-Right,FR4,1mm,730.9x10.5mm,10x"},{"$f":"VLOOKUP(B8,Materiál!B:J,5,FALSE)","v":"-"},{"$f":"VLOOKUP(B8,Materiál!B:J,4,FALSE)","v":"-"},473,"ICAPE",20,1,{"$f":"IF(K8=1,\"UVOĽNENÉ\",IF(K8=2,\"UPOZORNENIE\",IF(K8=3,\"UPOZOR. / NÁKL.\",IF(K8=4,\"REKLAMÁCIA\",\"-\"))))","v":"UVOĽNENÉ"},"Brišová",91700239,{"$f":"VLOOKUP(B8,Materiál!B:J,8,FALSE)","v":"dps"},"OK","OK","750,87max","161,49max","1+-0,1",null,"OK",null,null,null,null,4920,"OK",null,null,null,null,null,null,null,null,null,null,null,null,null,null,null,null,null,null,null,null,null,null,null,null,null,null,null,null,null,null,null,null,null,750,6.09,1.03,null,{"$f":"IF(G8=\"\",\"-\",(E8-((E8/100)*G8)))","v":{"$error":"#VALUE!"}},{"$f":"IF(G8=\"\",\"-\",(E8+((E8/100)*G8)))","v":{"$error":"#VALUE!"}}]
["2021-01-04","GA70-000003","BMW I20 Rear-Left, 10-násobná",null,{"$f":"VLOOKUP(B9,Materiál!B:J,3,FALSE)","v":"BMW I20 Rear-Left, 10-násobná"},{"$f":"VLOOKUP(B9,Materiál!B:J,5,FALSE)","v":"-"},{"$f":"VLOOKUP(B9,Materiál!B:J,4,FALSE)","v":"-"},500,"ICAPE",20,1,"UVOĽNENÉ","Brišová",91700239,{"$f":"VLOOKUP(B9,Materiál!B:J,8,FALSE)","v":"dps"},"OK","OK","562,4+-0,8","6+-0,1","1+-0,1",null,"OK",null,null,null,null,4920,"OK",null,null,null,null,null,null,null,null,null,null,null,null,null,null,null,null,null,null,null,null,null,null,null,null,null,null,null,null,null,null,null,null,null,560.4,6.08,1.08,null,{"$error":"#VALUE!"},{"$error":"#VALUE!"}]
["2021-01-05","GA70-000004","Rigid, FR4, 1.0mm, 2 Layers, 730.9 x 10.5 mm",null,{"$f":"VLOOKUP(B10,Materiál!B:J,3,FALSE)","v":"BMW I20 Rear-Right, 10-násobná"},{"$f":"VLOOKUP(B10,Materiál!B:J,5,FALSE)","v":"-"},{"$f":"VLOOKUP(B10,Materiál!B:J,4,FALSE)","v":"-"},500,"ICAPE",20,1,"UVOĽNENÉ","Brišová",91700239,{"$f":"VLOOKUP(B10,Materiál!B:J,8,FALSE)","v":"dps"},"OK","OK","562,49max","227,01max","1+-0,1",null,"OK",null,null,null,null,4420,"OK",null,null,null,null,null,null,null,null,null,null,null,null,null,null,null,null,null,null,null,null,null,null,null,null,null,null,null,null,null,null,null,null,null,562.1,6,1.07,null,{"$error":"#VALUE!"},{"$error":"#VALUE!"}]
["2021-01-05","GA70-000001","Rigid, FR4, 1.0mm, 2 Layers, 730.9 x 10.4 mm",null,{"$f":"VLOOKUP(B11,Materiál!B:J,3,FALSE)","v":"BMW I20 Front-Left,FR4,1mm,730.9x10.4mm,10x"},{"$f":"VLOOKUP(B11,Materiál!B:J,5,FALSE)","v":"-"},{"$f":"VLOOKUP(B11,Materiál!B:J,4,FALSE)","v":"-"},359,"ICAPE",20,1,"UVOĽNENÉ","Brišová",91700239,{"$f":"VLOOKUP(B11,Materiál!B:J,8,FALSE)","v":"dps"},"OK","OK","750,87max","161,49max",1.01,null,"OK",null,null,null,null,4420,"OK",null,null,null,null,null,null,null,null,null,null,null,null,null,null,null,null,null,null,null,null,null,null,null,null,null,null,null,null,null,null,null,null,null,162,750,1.0900000000000001,null,{"$error":"#VALUE!"},{"$error":"#VALUE!"}]
["2021-01-14","GA50-000002","4P,Silver pin",null,{"$f":"VLOOKUP(B12,Materiál!B:J,3,FALSE)","v":"4P,Silver pin"},{"$f":"VLOOKUP(B12,Materiál!B:J,5,FALSE)","v":"-"},{"$f":"VLOOKUP(B12,Materiál!B:J,4,FALSE)","v":"-"},1000,"W+P",32,1,"UVOĽNENÉ","Brišová","LI1661255",{"$f":"VLOOKUP(B12,Materiál!B:J,8,FALSE)","v":"kon"},"OK","OK","12max","9,5max","4max","OK","OK",null,null,null,"OK",null,null,null,null,null,null,null,null,null,null,null,null,null,null,null,null,null,null,null,null,null,null,null,null,null,null,null,null,null,null,null,null,null,null,null,12.03,9.4499999999999993,3.53,null,{"$error":"#VALUE!"},{"$error":"#VALUE!"}]
[null,{"$f":"Databáza!E3","v":"GA10-000003"},{"$f":"VLOOKUP(B13,Materiál!B:J,2,FALSE)","v":"Kondenzátor"},{"$f":"Databáza!F3","v":"R-Q-1812-F"},{"$f":"VLOOKUP(B13,Materiál!B:J,3,FALSE)","v":"100nF/16V,X7R"},{"$f":"VLOOKUP(B13,Materiál!B:J,5,FALSE)","v":"nF"},{"$f":"VLOOKUP(B13,Materiál!B:J,4,FALSE)","v":10},null,{"$f":"VLOOKUP(B13,Materiál!B:J,9,FALSE)","v":"RM Component"},null,null,"-",{"$f":"IF(H13=(\"\"),\"\",\"Brišová\")","v":""},null,{"$f":"VLOOKUP(B13,Materiál!B:J,8,FALSE)","v":"elp"},null,null,null,null,null,null,null,null,null,null,null,null,null,null,null,null,null,null,null,null,null,null,null,null,null,null,null,null,null,null,null,null,null,null,null,null,null,null,null,null,null,null,null,null,null,null,null,null,null,null,{"$error":"#VALUE!"},{"$error":"#VALUE!"}]
[null,{"$f":"Databáza!E4","v":"GA10-000003"},{"$f":"VLOOKUP(B14,Materiál!B:J,2,FALSE)","v":"Kondenzátor"},{"$f":"Databáza!F4","v":"R-Q-1812-F"},{"$f":"VLOOKUP(B14,Materiál!B:J,3,FALSE)","v":"100nF/16V,X7R"},{"$f":"VLOOKUP(B14,Materiál!B:J,5,FALSE)","v":"nF"},{"$f":"VLOOKUP(B14,Materiál!B:J,4,FALSE)","v":10},null,{"$f":"VLOOKUP(B14,Materiál!B:J,9,FALSE)","v":"RM Component"},null,null,{"$f":"IF(K14=1,\"UVOĽNENÉ\",IF(K14=2,\"UPOZORNENIE\",IF(K14=3,\"UPOZOR. / NÁKL.\",IF(K14=4,\"REKLAMÁCIA\",\"-\"))))","v":"-"},{"$f":"IF(H14=(\"\"),\"\",\"Brišová\")","v":""},null,{"$f":"VLOOKUP(B14,Materiál!B:J,8,FALSE)","v":"elp"},null,null,null,null,null,null,null,null,null,null,null,null,null,null,null,null,null,null,null,null,null,null,null,null,null,null,null,null,null,null,null,null,null,null,null,null,null,null,null,null,null,null,null,null,null,null,null,null,null,null,{"$error":"#VALUE!"},{"$error":"#VALUE!"}]
[null,{"$f":"Databáza!E5","v":0},{"$f":"VLOOKUP(B15,Materiál!B:J,2,FALSE)","v":{"$error":"#N/A"}},{"$f":"Databáza!F5","v":0},{"$f":"VLOOKUP(B15,Materiál!B:J,3,FALSE)","v":{"$error":"#N/A"}},{"$f":"VLOOKUP(B15,Materiál!B:J,5,FALSE)","v":{"$error":"#N/A"}},{"$f":"VLOOKUP(B15,Materiál!B:J,4,FALSE)","v":{"$error":"#N/A"}},null,{"$f":"VLOOKUP(B15,Materiál!B:J,9,FALSE)","v":{"$error":"#N/A"}},null,null,"-","",null,{"$f":"VLOOKUP(B15,Materiál!B:J,8,FALSE)","v":{"$error":"#N/A"}},null,null,null,null,null,null,null,null,null,null,null,null,null,null,null,null,null,null,null,null,null,null,null,null,null,null,null,null,null,null,null,null,null,null,null,null,null,null,null,null,null,null,null,null,null,null,null,null,null,null,{"$error":"#N/A"},{"$error":"#N/A"}]
[null,{"$f":"Databáza!E6","v":0},{"$f":"VLOOKUP(B16,Materiál!B:J,2,FALSE)","v":{"$error":"#N/A"}},{"$f":"Databáza!F6","v":0},{"$f":"VLOOKUP(B16,Materiál!B:J,3,FALSE)","v":{"$error":"#N/A"}},{"$f":"VLOOKUP(B16,Materiál!B:J,5,FALSE)","v":{"$error":"#N/A"}},{"$f":"VLOOKUP(B16,Materiál!B:J,4,FALSE)","v":{"$error":"#N/A"}},null,{"$f":"VLOOKUP(B16,Materiál!B:J,9,FALSE)","v":{"$error":"#N/A"}},null,null,"-","",null,{"$f":"VLOOKUP(B16,Materiál!B:J,8,FALSE)","v":{"$error":"#N/A"}},null,null,null,null,null,null,null,null,null,null,null,null,null,null,null,null,null,null,null,null,null,null,null,null,null,null,null,null,null,null,null,null,null,null,null,null,null,null,null,null,null,null,null,null,null,null,null,null,null,null,{"$error":"#N/A"},{"$error":"#N/A"}]
[null,{"$f":"Databáza!E7","v":0},{"$f":"VLOOKUP(B17,Materiál!B:J,2,FALSE)","v":{"$error":"#N/A"}},{"$f":"Databáza!F7","v":0},{"$f":"VLOOKUP(B17,Materiál!B:J,3,FALSE)","v":{"$error":"#N/A"}},{"$f":"VLOOKUP(B17,Materiál!B:J,5,FALSE)","v":{"$error":"#N/A"}},{"$f":"VLOOKUP(B17,Materiál!B:J,4,FALSE)","v":{"$error":"#N/A"}},null,{"$f":"VLOOKUP(B17,Materiál!B:J,9,FALSE)","v":{"$error":"#N/A"}},null,null,"-","",null,{"$f":"VLOOKUP(B17,Materiál!B:J,8,FALSE)","v":{"$error":"#N/A"}},null,null,null,null,null,null,null,null,null,null,null,null,null,null,null,null,null,null,null,null,null,null,null,null,null,null,null,null,null,null,null,null,null,null,null,null,null,null,null,null,null,null,null,null,null,null,null,null,null,null,{"$error":"#N/A"},{"$error":"#N/A"}]
[null,{"$f":"Databáza!E8","v":0},{"$f":"VLOOKUP(B18,Materiál!B:J,2,FALSE)","v":{"$error":"#N/A"}},{"$f":"Databáza!F8","v":0},{"$f":"VLOOKUP(B18,Materiál!B:J,3,FALSE)","v":{"$error":"#N/A"}},{"$f":"VLOOKUP(B18,Materiál!B:J,5,FALSE)","v":{"$error":"#N/A"}},{"$f":"VLOOKUP(B18,Materiál!B:J,4,FALSE)","v":{"$error":"#N/A"}},null,{"$f":"VLOOKUP(B18,Materiál!B:J,9,FALSE)","v":{"$error":"#N/A"}},null,null,"-","",null,{"$f":"VLOOKUP(B18,Materiál!B:J,8,FALSE)","v":{"$error":"#N/A"}},null,null,null,null,null,null,null,null,null,null,null,null,null,null,null,null,null,null,null,null,null,null,null,null,null,null,null,null,null,null,null,null,null,null,null,null,null,null,null,null,null,null,null,null,null,null,null,null,null,null,{"$error":"#N/A"},{"$error":"#N/A"}]
[null,{"$f":"Databáza!E9","v":0},{"$f":"VLOOKUP(B19,Materiál!B:J,2,FALSE)","v":{"$error":"#N/A"}},{"$f":"Databáza!F9","v":0},{"$f":"VLOOKUP(B19,Materiál!B:J,3,FALSE)","v":{"$error":"#N/A"}},{"$f":"VLOOKUP(B19,Materiál!B:J,5,FALSE)","v":{"$error":"#N/A"}},{"$f":"VLOOKUP(B19,Materiál!B:J,4,FALSE)","v":{"$error":"#N/A"}},null,{"$f":"VLOOKUP(B19,Materiál!B:J,9,FALSE)","v":{"$error":"#N/A"}},null,null,"-","",null,{"$f":"VLOOKUP(B19,Materiál!B:J,8,FALSE)","v":{"$error":"#N/A"}},null,null,null,null,null,null,null,null,null,null,null,null,null,null,null,null,null,null,null,null,null,null,null,null,null,null,null,null,null,null,null,null,null,null,null,null,null,null,null,null,null,null,null,null,null,null,null,null,null,null,{"$error":"#N/A"},{"$error":"#N/A"}]
[null,{"$f":"Databáza!E10","v":0},{"$f":"VLOOKUP(B20,Materiál!B:J,2,FALSE)","v":{"$error":"#N/A"}},{"$f":"Databáza!F10","v":0},{"$f":"VLOOKUP(B20,Materiál!B:J,3,FALSE)","v":{"$error":"#N/A"}},{"$f":"VLOOKUP(B20,Materiál!B:J,5,FALSE)","v":{"$error":"#N/A"}},{"$f":"VLOOKUP(B20,Materiál!B:J,4,FALSE)","v":{"$error":"#N/A"}},null,{"$f":"VLOOKUP(B20,Materiál!B:J,9,FALSE)","v":{"$error":"#N/A"}},null,null,"-","",null,{"$f":"VLOOKUP(B20,Materiál!B:J,8,FALSE)","v":{"$error":"#N/A"}},null,null,null,null,null,null,null,null,null,null,null,null,null,null,null,null,null,null,null,null,null,null,null,null,null,null,null,null,null,null,null,null,null,null,null,null,null,null,null,null,null,null,null,null,null,null,null,null,null,null,{"$error":"#N/A"},{"$error":"#N/A"}]
[null,{"$f":"Databáza!E11","v":0},{"$f":"VLOOKUP(B21,Materiál!B:J,2,FALSE)","v":{"$error":"#N/A"}},{"$f":"Databáza!F11","v":0},{"$f":"VLOOKUP(B21,Materiál!B:J,3,FALSE)","v":{"$error":"#N/A"}},{"$f":"VLOOKUP(B21,Materiál!B:J,5,FALSE)","v":{"$error":"#N/A"}},{"$f":"VLOOKUP(B21,Materiál!B:J,4,FALSE)","v":{"$error":"#N/A"}},null,{"$f":"VLOOKUP(B21,Materiál!B:J,9,FALSE)","v":{"$error":"#N/A"}},null,null,"-","",null,{"$f":"VLOOKUP(B21,Materiál!B:J,8,FALSE)","v":{"$error":"#N/A"}},null,null,null,null,null,null,null,null,null,null,null,null,null,null,null,null,null,null,null,null,null,null,null,null,null,null,null,null,null,null,null,null,null,null,null,null,null,null,null,null,null,null,null,null,null,null,null,null,null,null,{"$error":"#N/A"},{"$error":"#N/A"}]
[null,{"$f":"Databáza!E12","v":0},{"$f":"VLOOKUP(B22,Materiál!B:J,2,FALSE)","v":{"$error":"#N/A"}},{"$f":"Databáza!F12","v":0},{"$f":"VLOOKUP(B22,Materiál!B:J,3,FALSE)","v":{"$error":"#N/A"}},{"$f":"VLOOKUP(B22,Materiál!B:J,5,FALSE)","v":{"$error":"#N/A"}},{"$f":"VLOOKUP(B22,Materiál!B:J,4,FALSE)","v":{"$error":"#N/A"}},null,{"$f":"VLOOKUP(B22,Materiál!B:J,9,FALSE)","v":{"$error":"#N/A"}},null,null,"-","",null,{"$f":"VLOOKUP(B22,Materiál!B:J,8,FALSE)","v":{"$error":"#N/A"}},null,null,null,null,null,null,null,null,null,null,null,null,null,null,null,null,null,null,null,null,null,null,null,null,null,null,null,null,null,null,null,null,null,null,null,null,null,null,null,null,null,null,null,null,null,null,null,null,null,null,{"$error":"#N/A"},{"$error":"#N/A"}]
[null,{"$f":"Databáza!E13","v":0},{"$f":"VLOOKUP(B23,Materiál!B:J,2,FALSE)","v":{"$error":"#N/A"}},{"$f":"Databáza!F13","v":0},{"$f":"VLOOKUP(B23,Materiál!B:J,3,FALSE)","v":{"$error":"#N/A"}},{"$f":"VLOOKUP(B23,Materiál!B:J,5,FALSE)","v":{"$error":"#N/A"}},{"$f":"VLOOKUP(B23,Materiál!B:J,4,FALSE)","v":{"$error":"#N/A"}},null,{"$f":"VLOOKUP(B23,Materiál!B:J,9,FALSE)","v":{"$error":"#N/A"}},null,null,"-","",null,{"$f":"VLOOKUP(B23,Materiál!B:J,8,FALSE)","v":{"$error":"#N/A"}},null,null,null,null,null,null,null,null,null,null,null,null,null,null,null,null,null,null,null,null,null,null,null,null,null,null,null,null,null,null,null,null,null,null,null,null,null,null,null,null,null,null,null,null,null,null,null,null,null,null,{"$error":"#N/A"},{"$error":"#N/A"}]
[null,{"$f":"Databáza!E14","v":0},{"$f":"VLOOKUP(B24,Materiál!B:J,2,FALSE)","v":{"$error":"#N/A"}},{"$f":"Databáza!F14","v":0},{"$f":"VLOOKUP(B24,Materiál!B:J,3,FALSE)","v":{"$error":"#N/A"}},{"$f":"VLOOKUP(B24,Materiál!B:J,5,FALSE)","v":{"$error":"#N/A"}},{"$f":"VLOOKUP(B24,Materiál!B:J,4,FALSE)","v":{"$error":"#N/A"}},null,{"$f":"VLOOKUP(B24,Materiál!B:J,9,FALSE)","v":{"$error":"#N/A"}},null,null,"-","",null,{"$f":"VLOOKUP(B24,Materiál!B:J,8,FALSE)","v":{"$error":"#N/A"}},null,null,null,null,null,null,null,null,null,null,null,null,null,null,null,null,null,null,null,null,null,null,null,null,null,null,null,null,null,null,null,null,null,null,null,null,null,null,null,null,null,null,null,null,null,null,null,null,null,null,{"$error":"#N/A"},{"$error":"#N/A"}]
[null,{"$f":"Databáza!E15","v":0},{"$f":"VLOOKUP(B25,Materiál!B:J,2,FALSE)","v":{"$error":"#N/A"}},{"$f":"Databáza!F15","v":0},{"$f":"VLOOKUP(B25,Materiál!B:J,3,FALSE)","v":{"$error":"#N/A"}},{"$f":"VLOOKUP(B25,Materiál!B:J,5,FALSE)","v":{"$error":"#N/A"}},{"$f":"VLOOKUP(B25,Materiál!B:J,4,FALSE)","v":{"$error":"#N/A"}},null,{"$f":"VLOOKUP(B25,Materiál!B:J,9,FALSE)","v":{"$error":"#N/A"}},null,null,"-","",null,{"$f":"VLOOKUP(B25,Materiál!B:J,8,FALSE)","v":{"$error":"#N/A"}},null,null,null,null,null,null,null,null,null,null,null,null,null,null,null,null,null,null,null,null,null,null,null,null,null,null,null,null,null,null,null,null,null,null,null,null,null,null,null,null,null,null,null,null,null,null,null,null,null,null,{"$error":"#N/A"},{"$error":"#N/A"}]
[null,{"$f":"Databáza!E16","v":0},{"$f":"VLOOKUP(B26,Materiál!B:J,2,FALSE)","v":{"$error":"#N/A"}},{"$f":"Databáza!F16","v":0},{"$f":"VLOOKUP(B26,Materiál!B:J,3,FALSE)","v":{"$error":"#N/A"}},{"$f":"VLOOKUP(B26,Materiál!B:J,5,FALSE)","v":{"$error":"#N/A"}},{"$f":"VLOOKUP(B26,Materiál!B:J,4,FALSE)","v":{"$error":"#N/A"}},null,{"$f":"VLOOKUP(B26,Materiál!B:J,9,FALSE)","v":{"$error":"#N/A"}},null,null,"-","",null,{"$f":"VLOOKUP(B26,Materiál!B:J,8,FALSE)","v":{"$error":"#N/A"}},null,null,null,null,null,null,null,null,null,null,null,null,null,null,null,null,null,null,null,null,null,null,null,null,null,null,null,null,null,null,null,null,null,null,null,null,null,null,null,null,null,null,null,null,null,null,null,null,null,null,{"$error":"#N/A"},{"$error":"#N/A"}]
[null,{"$f":"Databáza!E17","v":0},{"$f":"VLOOKUP(B27,Materiál!B:J,2,FALSE)","v":{"$error":"#N/A"}},{"$f":"Databáza!F17","v":0},{"$f":"VLOOKUP(B27,Materiál!B:J,3,FALSE)","v":{"$error":"#N/A"}},{"$f":"VLOOKUP(B27,Materiál!B:J,5,FALSE)","v":{"$error":"#N/A"}},{"$f":"VLOOKUP(B27,Materiál!B:J,4,FALSE)","v":{"$error":"#N/A"}},null,{"$f":"VLOOKUP(B27,Materiál!B:J,9,FALSE)","v":{"$error":"#N/A"}},null,null,"-","",null,{"$f":"VLOOKUP(B27,Materiál!B:J,8,FALSE)","v":{"$error":"#N/A"}},null,null,null,null,null,null,null,null,null,null,null,null,null,null,null,null,null,null,null,null,null,null,null,null,null,null,null,null,null,null,null,null,null,null,null,null,null,null,null,null,null,null,null,null,null,null,null,null,null,null,{"$error":"#N/A"},{"$error":"#N/A"}]
[null,{"$f":"Databáza!E18","v":0},{"$f":"VLOOKUP(B28,Materiál!B:J,2,FALSE)","v":{"$error":"#N/A"}},{"$f":"Databáza!F18","v":0},{"$f":"VLOOKUP(B28,Materiál!B:J,3,FALSE)","v":{"$error":"#N/A"}},{"$f":"VLOOKUP(B28,Materiál!B:J,5,FALSE)","v":{"$error":"#N/A"}},{"$f":"VLOOKUP(B28,Materiál!B:J,4,FALSE)","v":{"$error":"#N/A"}},null,{"$f":"VLOOKUP(B28,Materiál!B:J,9,FALSE)","v":{"$error":"#N/A"}},null,null,"-","",null,{"$f":"VLOOKUP(B28,Materiál!B:J,8,FALSE)","v":{"$error":"#N/A"}},null,null,null,null,null,null,null,null,null,null,null,null,null,null,null,null,null,null,null,null,null,null,null,null,null,null,null,null,null,null,null,null,null,null,null,null,null,null,null,null,null,null,null,null,null,null,null,null,null,null,{"$error":"#N/A"},{"$error":"#N/A"}]
[null,{"$f":"Databáza!E19","v":0},{"$f":"VLOOKUP(B29,Materiál!B:J,2,FALSE)","v":{"$error":"#N/A"}},{"$f":"Databáza!F19","v":0},{"$f":"VLOOKUP(B29,Materiál!B:J,3,FALSE)","v":{"$error":"#N/A"}},{"$f":"VLOOKUP(B29,Materiál!B:J,5,FALSE)","v":{"$error":"#N/A"}},{"$f":"VLOOKUP(B29,Materiál!B:J,4,FALSE)","v":{"$error":"#N/A"}},null,{"$f":"VLOOKUP(B29,Materiál!B:J,9,FALSE)","v":{"$error":"#N/A"}},null,null,"-","",null,{"$f":"VLOOKUP(B29,Materiál!B:J,8,FALSE)","v":{"$error":"#N/A"}},null,null,null,null,null,null,null,null,null,null,null,null,null,null,null,null,null,null,null,null,null,null,null,null,null,null,null,null,null,null,null,null,null,null,null,null,null,null,null,null,null,null,null,null,null,null,null,null,null,null,{"$error":"#N/A"},{"$error":"#N/A"}]
[null,{"$f":"Databáza!E20","v":0},{"$f":"VLOOKUP(B30,Materiál!B:J,2,FALSE)","v":{"$error":"#N/A"}},{"$f":"Databáza!F20","v":0},{"$f":"VLOOKUP(B30,Materiál!B:J,3,FALSE)","v":{"$error":"#N/A"}},{"$f":"VLOOKUP(B30,Materiál!B:J,5,FALSE)","v":{"$error":"#N/A"}},{"$f":"VLOOKUP(B30,Materiál!B:J,4,FALSE)","v":{"$error":"#N/A"}},null,{"$f":"VLOOKUP(B30,Materiál!B:J,9,FALSE)","v":{"$error":"#N/A"}},null,null,"-","",null,{"$f":"VLOOKUP(B30,Materiál!B:J,8,FALSE)","v":{"$error":"#N/A"}},null,null,null,null,null,null,null,null,null,null,null,null,null,null,null,null,null,null,null,null,null,null,null,null,null,null,null,null,null,null,null,null,null,null,null,null,null,null,null,null,null,null,null,null,null,null,null,null,null,null,{"$error":"#N/A"},{"$error":"#N/A"}]
{"$rows_left_out":147}
{"sheet":"Databáza","index":1,"n_rows":4,"n_cols":12,"rows_kept":4,"cut":false,"hidden":false,"merged":[]}
[]
[null,"Naskenovaný čiarový kód","Avex","Riadený sklad","Materiál","Lot number","Číslo záznamu","Príjem","Množstvo","Počet ks","Expirácia","Kvalita"]
[null,".L0;940;GA10-000003;R-Q-1812-F;110000515109;20200923;10000;ST;20210923;",".L0",940,"GA10-000003","R-Q-1812-F",110000515109,20200923,10000,"ST",20210923]
[null,".L0;940;GA10-000003;R-Q-1812-F;110000515109;20200923;10000;ST;20210923;",".L0",940,"GA10-000003","R-Q-1812-F",110000515109,20200923,10000,"ST",20210923]

{"sheet":"Materiál","index":2,"n_rows":20,"n_cols":10,"rows_kept":20,"cut":false,"hidden":false,"merged":[]}
[]
[null,"JK","Názov","Druh materiálu","Tolerancia","Jednotka","Puzdro","Osádzanie","Skratka","Dodávateľ"]
[null,"GA10-000001","Kondenzátor","220pF/50V,COG",5,"pF","0402","SMT","elp","RM Component"]
[null,"GA10-000002","Kondenzátor","1uF/16V,X7R",10,"uF","0603","SMT","elp","Rutronik"]
[null,"GA10-000003","Kondenzátor","100nF/16V,X7R",10,"nF","0402","SMT","elp","RM Component"]
[null,"GA10-000004","Kondenzátor","100pF/50V,COG",5,"pF","0402","SMT","elp","RM Component"]
[null,"GA10-000005","Kondenzátor","10pF/50V,COG","0.5pF","pF","0402","SMT","elp","RM Component"]
[null,"GA10-000006","Kondenzátor","3pF/50V,COG","0.25pF","pF","0402","SMT","elp","RM Component"]
[null,"GA20-000001","Dióda","ESD, 7V, obojsmerná",5,"V","SOD882","SMT","ela","Mouser"]
[null,"GA23-000001","Dióda zenerová","5.6V",5,"V","SOD123","SMT","ela","IC Blue"]
[null,"GA40-000001","IC","SMD-IC, LED-Driver, SMRTB-1250, 3628","-","-","3628","SMT","kon","Dominant"]
[null,"GA50-000001","Konektor","4P","-","-","nanoMQS","SMT","kon","GA"]
[null,"GA50-000002","Konektor","4P,Silver pin","-","-","nanoMQS","SMT","kon","W+P"]
[null,"GA70-000001","DPS","BMW I20 Front-Left,FR4,1mm,730.9x10.4mm,10x","-","-","-","SMT","dps","ICAPE"]
[null,"GA70-000002","DPS","BMW I20 Front-Right,FR4,1mm,730.9x10.5mm,10x","-","-","-","SMT","dps","ICAPE"]
[null,"GA70-000003","DPS","BMW I20 Rear-Left, 10-násobná","-","-","-","SMT","dps","ICAPE"]
[null,"GA70-000004","DPS","BMW I20 Rear-Right, 10-násobná","-","-","-","SMT","dps","ICAPE"]
[null,"GA80-000001","Cievka","22uH, 0.25A, 0.5Ohm",30,"uH","1210","SMT","elp","Farnel"]
[null,"GA80-000002","Cievka","11uH, 0.3A, 0.4Ohm",30,"uH","1210","SMT","elp","Mouser"]
[null,"GA80-000003","Cievka","75nH, 0.2A, 1.5Ohm",5,"nH","0402","SMT","elp","Mouser"]