{"text_format":"1","workbook":"xlsx","n_sheets":2,"sheets":["Hárok1","Hárok2"],"not_rendered":{"charts":0,"images":1,"macros":0,"external_links":0,"defined_names":1,"comments":0,"pivot_tables":0},"unopened":[],"bounds":{"document_bytes":16777216,"sheet_cells":100000,"rows_first":2000,"rows_last":500,"rows_between":2000,"halvings":0,"cell_chars":16384,"cell_head_chars":4096},"cells_cut":0,"cells_raw":0,"read":"whole","date_system":"1900"}

{"sheet":"Hárok1","index":0,"n_rows":451,"n_cols":8,"rows_kept":451,"cut":false,"hidden":false,"merged":[]}
["Pohlavie","Poradie","Meno",null,"Priradí meno",null,"Generátor náhodného čísla","Ctrl+R"]
[1,1,"Adam ",null,{"$f":"VLOOKUP(G2,Hárok1!B:C,2,0)","v":"Petrana"},null,{"$f":"RANDBETWEEN(B2,B451)","v":338}]
[2,2,"Adela "]
[1,3,"Adolf"]
[1,4,"Adrián"]
[2,5,"Adriána"]
[2,6,"Agáta "]
[2,7,"Agnesa "]
[1,8,"Alan "]
[2,9,"Alana"]
[1,10,"Albert "]
[1,11,"Albín"]
[2,12,"Albína"]
[2,13,"Alena"]
[1,14,"Aleš"]
[1,15,"Alex "]
[1,16,"Alexander "]
[2,17,"Alexandra"]
[1,18,"Alexej"]
[2,19,"Alexia"]
[1,20,"Alfonz"]
[1,21,"Alfréd"]
[2,22,"Alica"]
[1,23,"Alojz"]
[2,24,"Alojzia"]
[2,25,"Alžbeta "]
[2,26,"Amália"]
[1,27,"Ambróz"]
[2,28,"Anabela"]
[2,29,"Andrea"]
[1,30,"Andrej"]
[2,31,"Anežka"]
[2,32,"Angela"]
[2,33,"Angelika"]
[2,34,"Anna "]
[1,35,"Anton"]
[2,36,"Antónia"]
[1,37,"Ariel "]
[2,38,"Ariel "]
[1,39,"Arnold"]
[1,40,"Áron "]
[1,41,"Arpád "]
[1,42,"Atila "]
[1,43,"Augustín "]
[1,44,"Aurel "]
[2,45,"Aurélia"]
[2,46,"Ayala"]
[2,47,"Barbara "]
[2,48,"Barbora "]
[1,49,"Bartolomej "]
[2,50,"Beáta"]
[1,51,"Belo "]
[1,52,"Beňadik"]
[1,53,"Benedikt "]
[1,54,"Benjamín "]
[1,55,"Bernard "]
[2,56,"Berta"]
[2,57,"Bianka"]
[2,58,"Bibiána"]
[1,59,"Blahoslav"]
[2,60,"Blanka "]
[1,61,"Blažej "]
[2,62,"Blažena"]
[1,63,"Bohdan"]
[2,64,"Bohdana"]
[1,65,"Bohumil"]
[2,66,"Bohumila"]
[1,67,"Bohumír"]
[1,68,"Bohuslav "]
[2,69,"Bohuslava"]
[1,70,"Bohuš"]
[1,71,"Boleslav "]
[1,72,"Bonifác"]
[1,73,"Boris "]
[2,74,"Božena"]
[2,75,"Božidara"]
[1,76,"Branislav"]
[2,77,"Branislava"]
[2,78,"Brigita"]
[2,79,"Bronislava"]
[1,80,"Bruno"]
[1,81,"Bystrík "]
[2,82,"Cecília"]
[1,83,"Ctibor"]
[1,84,"Cyprián"]
[1,85,"Cyril "]
[2,86,"Dagmara"]
[1,87,"Dalibor"]
[2,88,"Dana "]
[2,89,"Danica"]
[1,90,"Daniel "]
[2,91,"Daniela"]
[2,92,"Darina"]
[2,93,"Dáša"]
[1,94,"Dávid "]
[1,95,"Demeter "]
[1,96,"Denis"]
[2,97,"Denisa"]
[1,98,"Dezider"]
[2,99,"Diana "]
[1,100,"Dionýz "]
[2,101,"Dobromila"]
[1,102,"Dobroslav"]
[2,103,"Dobroslava "]
[1,104,"Dominik"]
[2,105,"Dominika "]
[2,106,"Dorota "]
[1,107,"Drahomír"]
[2,108,"Drahomíra"]
[1,109,"Drahoslav"]
[2,110,"Drahoslava"]
[1,111,"Dušan"]
[1,112,"Eder "]
[2,113,"Edita"]
[1,114,"Edmund"]
[1,115,"Eduard"]
[2,116,"Ela"]
[2,117,"Elena"]
[2,118,"Eleonóra"]
[1,119,"Eliáš "]
[2,120,"Elisa "]
[2,121,"Eliška"]
[2,122,"Elvíra"]
[2,123,"Ema"]
[1,124,"Emanuel"]
[1,125,"Emil"]
[2,126,"Emília"]
[2,127,"Enna "]
[1,128,"Erik"]
[2,129,"Erika"]
[1,130,"Ernest"]
[1,131,"Ervín"]
[2,132,"Ester "]
[2,133,"Estera"]
[2,134,"Etela"]
[1,135,"Eugen"]
[2,136,"Eugénia"]
[2,137,"Eulália"]
[2,138,"Eunika"]
[2,139,"Eva "]
[1,140,"Fedor "]
[1,141,"Félix "]
[1,142,"Ferdinand "]
[1,143,"Filip "]
[2,144,"Filoména"]
[1,145,"Florián "]
[1,146,"František "]
[2,147,"Františka"]
[1,148,"Frederik"]
[2,149,"Frederika"]
[1,150,"Fridrich"]
[1,151,"Gabriel "]
[2,152,"Gabriela"]
[2,153,"Galina"]
[1,154,"Gašpar "]
[1,155,"Gejza "]
[2,156,"Gertrúda"]
[2,157,"Gizela"]
[1,158,"Gregor "]
[1,159,"Gustáv"]
[2,160,"Halina"]
[2,161,"Hana"]
[2,162,"Hedviga"]
[2,163,"Helena "]
[2,164,"Henrieta"]
[1,165,"Henrich "]
[1,166,"Herbert"]
[2,167,"Hermína"]
[2,168,"Hilda"]
[2,169,"Hortenzia "]
[1,170,"Hubert"]
[1,171,"Hugo"]
[2,172,"Chloe"]
[2,173,"Ida "]
[1,174,"Ignác"]
[1,175,"Igor"]
[1,176,"Iľja"]
[1,177,"Imrich "]
[2,178,"Ingrida"]
[2,179,"Irena "]
[2,180,"Iris "]
[2,181,"Irma"]
[1,182,"Ivan "]
[2,183,"Ivana"]
[2,184,"Iveta"]
[2,185,"Ivica"]
[2,186,"Ivona"]
[2,187,"Izabela"]
[1,188,"Izidor"]
[1,189,"Jakub "]
[1,190,"Ján "]
[2,191,"Jana "]
[2,192,"Jarmila"]
[1,193,"Jarolím"]
[1,194,"Jaromír "]
[1,195,"Jaroslav"]
[2,196,"Jaroslava"]
[2,197,"Jela"]
[1,198,"Jerguš"]
[1,199,"Jerry "]
[2,200,"Jerry "]
[2,201,"Jesika"]
[2,202,"Jolana"]
[1,203,"Jonáš "]
[1,204,"Jozef "]
[2,205,"Jozefína"]
[2,206,"Judita "]
[2,207,"Júlia"]
[2,208,"Juliana"]
[1,209,"Július "]
[1,210,"Juraj "]
[2,211,"Justína"]
[1,212,"Kamil"]
[2,213,"Kamila"]
[2,214,"Karina"]
[2,215,"Karla"]
[1,216,"Karol "]
[2,217,"Karolína "]
[2,218,"Katarína "]
[1,219,"Kazimír "]
[2,220,"Klára"]
[2,221,"Klaudia"]
[1,222,"Klement "]
[1,223,"Kliment "]
[1,224,"Koloman "]
[1,225,"Konštantín "]
[1,226,"Kornel"]
[2,227,"Kornélia"]
[1,228,"Kristián"]
[2,229,"Kristína"]
[1,230,"Krištof "]
[1,231,"Kvetoslav"]
[2,232,"Kvetoslava"]
[1,233,"Ladislav "]
[2,234,"Ladislava"]
[2,235,"Laura"]
[2,236,"Lea"]
[2,237,"Lenka "]
[1,238,"Leonard"]
[1,239,"Leopold "]
[2,240,"Leopolda"]
[2,241,"Lesana"]
[2,242,"Lesia"]
[1,243,"Levoslav"]
[2,244,"Liana "]
[1,245,"Libor"]
[2,246,"Libuša "]
[2,247,"Linda"]
[2,248,"Lívia"]
[2,249,"Lolita "]
[2,250,"Ľubica "]
[1,251,"Ľubomír"]
[2,252,"Ľubomíra"]
[1,253,"Ľubor"]
[1,254,"Ľuboslav"]
[2,255,"Ľuboslava"]
[1,256,"Ľuboš"]
[2,257,"Lucia "]
[2,258,"Ľudmila "]
[1,259,"Ľudomil"]
[2,260,"Ľudomila"]
[1,261,"Ľudovít "]
[2,262,"Lujza"]
[1,263,"Lukáš "]
[2,264,"Luna "]
[2,265,"Lýdia "]
[2,266,"Magdaléna"]
[2,267,"Malvína"]
[1,268,"Marcel"]
[2,269,"Marcela"]
[1,270,"Marek "]
[2,271,"Margaréta "]
[2,272,"Margita "]
[2,273,"Mária "]
[1,274,"Marián "]
[2,275,"Marianna"]
[2,276,"Marika"]
[2,277,"Marína "]
[1,278,"Mário"]
[1,279,"Maroš "]
[2,280,"Marta "]
[1,281,"Martin "]
[2,282,"Martina "]
[1,283,"Matej "]
[2,284,"Matilda"]
[1,285,"Matúš"]
[1,286,"Maximilián"]
[1,287,"Medard "]
[2,288,"Melánia"]
[1,289,"Melichar "]
[1,290,"Metod"]
[2,291,"Michaela"]
[1,292,"Michal "]
[1,293,"Mikuláš "]
[2,294,"Milada "]
[1,295,"Milan "]
[2,296,"Milena"]
[2,297,"Milica"]
[1,298,"Miloslav"]
[2,299,"Miloslava"]
[1,300,"Miloš"]
[2,301,"Milota "]
[2,302,"Miriama"]
[1,303,"Miroslav"]
[2,304,"Miroslava"]
[1,305,"Mojmír "]
[2,306,"Monika"]
[1,307,"Móric "]
[2,308,"Mutsumi"]
[2,309,"Nadežda"]
[2,310,"Natália"]
[2,311,"Nataša"]
[1,312,"Nathan"]
[1,313,"Nikola"]
[2,314,"Nikola"]
[2,315,"Nina"]
[2,316,"Nora "]
[1,317,"Norbert "]
[1,318,"Odin "]
[1,319,"Oldrich"]
[1,320,"Oleg"]
[2,321,"Oľga"]
[1,322,"Oliver"]
[2,323,"Olívia"]
[2,324,"Olympia "]
[1,325,"Ondrej "]
[1,326,"Oskár"]
[2,327,"Otília"]
[1,328,"Oto"]
[2,329,"Oxana"]
[1,330,"Pankrác "]
[2,331,"Patrícia"]
[1,332,"Patrik "]
[2,333,"Paulína"]
[1,334,"Pavol "]
[2,335,"Perla "]
[1,336,"Peter "]
[2,337,"Petra "]
[2,338,"Petrana"]
[2,339,"Petronela"]
[1,340,"Pravoslav"]
[1,341,"Prokop"]
[1,342,"Radomír"]
[1,343,"Radoslav"]
[2,344,"Radoslava"]
[1,345,"Radovan"]
[1,346,"Radúz"]
[1,347,"Rastislav "]
[2,348,"Rebeka "]
[2,349,"Regína "]
[2,350,"Renáta"]
[1,351,"René"]
[1,352,"Richard "]
[1,353,"Rishi"]
[1,354,"Róbert"]
[1,355,"Roland"]
[1,356,"Roman "]
[2,357,"Romana"]
[2,358,"Rozália"]
[1,359,"Rudolf"]
[2,360,"Ružena"]
[2,361,"Sabína"]
[1,362,"Samuel "]
[2,363,"Sandra "]
[2,364,"Sára "]
[2,365,"Saskia"]
[1,366,"Sebastián"]
[1,367,"Sergej"]
[1,368,"Servác"]
[1,369,"Seth "]
[1,370,"Severín "]
[2,371,"Sidónia"]
[1,372,"Silvester"]
[2,373,"Silvia"]
[2,374,"Simona"]
[2,375,"Sláva"]
[2,376,"Slávka"]
[1,377,"Slavomír "]
[2,378,"Slavomíra"]
[2,379,"Sofia "]
[2,380,"Soňa"]
[1,381,"Stanislav "]
[2,382,"Stanislava"]
[2,383,"Stela"]
[1,384,"Svätopluk "]
[2,385,"Svetlana"]
[1,386,"Svetozár"]
[2,387,"Šarlota"]
[1,388,"Šimon "]
[1,389,"Štefan "]
[2,390,"Štefánia"]
[1,391,"Tadeáš"]
[2,392,"Tamara"]
[2,393,"Tatiana"]
[1,394,"Teodor "]
[2,395,"Terézia"]
[2,396,"Theodora "]
[1,397,"Tibor"]
[2,398,"Tiffany "]
[1,399,"Tichomír"]
{"$rows_left_out":52}
{"sheet":"Hárok2","index":1,"n_rows":451,"n_cols":7,"rows_kept":451,"cut":false,"hidden":false,"merged":[]}
["Poradie","Meno",null,"Víťaz",null,"Generátor náhodného čísla","Ctrl+R"]
[1,"Adam ",null,{"$f":"VLOOKUP(F2,Hárok1!B:C,2,0)","v":"Eder "},null,{"$f":"RANDBETWEEN(A2,A451)","v":112}]
[2,"Adela "]
[3,"Adolf"]
[4,"Adrián"]
[5,"Adriána"]
[6,"Agáta "]
[7,"Agnesa "]
[8,"Alan "]
[9,"Alana"]
[10,"Albert "]
[11,"Albín"]
[12,"Albína"]
[13,"Alena"]
[14,"Aleš"]
[15,"Alex "]
[16,"Alexander "]
[17,"Alexandra"]
[18,"Alexej"]
[19,"Alexia"]
[20,"Alfonz"]
[21,"Alfréd"]
[22,"Alica"]
[23,"Alojz"]
[24,"Alojzia"]
[25,"Alžbeta "]
[26,"Amália"]
[27,"Ambróz"]
[28,"Anabela"]
[29,"Andrea"]
[30,"Andrej"]
[31,"Anežka"]
[32,"Angela"]
[33,"Angelika"]
[34,"Anna "]
[35,"Anton"]
[36,"Antónia"]
[37,"Ariel "]
[38,"Ariel "]
[39,"Arnold"]
[40,"Áron "]
[41,"Arpád "]
[42,"Atila "]
[43,"Augustín "]
[44,"Aurel "]
[45,"Aurélia"]
[46,"Ayala"]
[47,"Barbara "]
[48,"Barbora "]
[49,"Bartolomej "]
[50,"Beáta"]
[51,"Belo "]
[52,"Beňadik"]
[53,"Benedikt "]
[54,"Benjamín "]
[55,"Bernard "]
[56,"Berta"]
[57,"Bianka"]
[58,"Bibiána"]
[59,"Blahoslav"]
[60,"Blanka "]
[61,"Blažej "]
[62,"Blažena"]
[63,"Bohdan"]
[64,"Bohdana"]
[65,"Bohumil"]
[66,"Bohumila"]
[67,"Bohumír"]
[68,"Bohuslav "]
[69,"Bohuslava"]
[70,"Bohuš"]
[71,"Boleslav "]
[72,"Bonifác"]
[73,"Boris "]
[74,"Božena"]
[75,"Božidara"]
[76,"Branislav"]
[77,"Branislava"]
[78,"Brigita"]
[79,"Bronislava"]
[80,"Bruno"]
[81,"Bystrík "]
[82,"Cecília"]
[83,"Ctibor"]
[84,"Cyprián"]
[85,"Cyril "]
[86,"Dagmara"]
[87,"Dalibor"]
[88,"Dana "]
[89,"Danica"]
[90,"Daniel "]
[91,"Daniela"]
[92,"Darina"]
[93,"Dáša"]
[94,"Dávid "]
[95,"Demeter "]
[96,"Denis"]
[97,"Denisa"]
[98,"Dezider"]
[99,"Diana "]
[100,"Dionýz "]
[101,"Dobromila"]
[102,"Dobroslav"]
[103,"Dobroslava "]
[104,"Dominik"]
[105,"Dominika "]
[106,"Dorota "]
[107,"Drahomír"]
[108,"Drahomíra"]
[109,"Drahoslav"]
[110,"Drahoslava"]
[111,"Dušan"]
[112,"Eder "]
[113,"Edita"]
[114,"Edmund"]
[115,"Eduard"]
[116,"Ela"]
[117,"Elena"]
[118,"Eleonóra"]
[119,"Eliáš "]
[120,"Elisa "]
[121,"Eliška"]
[122,"Elvíra"]
[123,"Ema"]
[124,"Emanuel"]
[125,"Emil"]
[126,"Emília"]
[127,"Enna "]
[128,"Erik"]
[129,"Erika"]
[130,"Ernest"]
[131,"Ervín"]
[132,"Ester "]
[133,"Estera"]
[134,"Etela"]
[135,"Eugen"]
[136,"Eugénia"]
[137,"Eulália"]
[138,"Eunika"]
[139,"Eva "]
[140,"Fedor "]
[141,"Félix "]
[142,"Ferdinand "]
[143,"Filip "]
[144,"Filoména"]
[145,"Florián "]
[146,"František "]
[147,"Františka"]
[148,"Frederik"]
[149,"Frederika"]
[150,"Fridrich"]
[151,"Gabriel "]
[152,"Gabriela"]
[153,"Galina"]
[154,"Gašpar "]
[155,"Gejza "]
[156,"Gertrúda"]
[157,"Gizela"]
[158,"Gregor "]
[159,"Gustáv"]
[160,"Halina"]
[161,"Hana"]
[162,"Hedviga"]
[163,"Helena "]
[164,"Henrieta"]
[165,"Henrich "]
[166,"Herbert"]
[167,"Hermína"]
[168,"Hilda"]
[169,"Hortenzia "]
[170,"Hubert"]
[171,"Hugo"]
[172,"Chloe"]
[173,"Ida "]
[174,"Ignác"]
[175,"Igor"]
[176,"Iľja"]
[177,"Imrich "]
[178,"Ingrida"]
[179,"Irena "]
[180,"Iris "]
[181,"Irma"]
[182,"Ivan "]
[183,"Ivana"]
[184,"Iveta"]
[185,"Ivica"]
[186,"Ivona"]
[187,"Izabela"]
[188,"Izidor"]
[189,"Jakub "]
[190,"Ján "]
[191,"Jana "]
[192,"Jarmila"]
[193,"Jarolím"]
[194,"Jaromír "]
[195,"Jaroslav"]
[196,"Jaroslava"]
[197,"Jela"]
[198,"Jerguš"]
[199,"Jerry "]
[200,"Jerry "]
[201,"Jesika"]
[202,"Jolana"]
[203,"Jonáš "]
[204,"Jozef "]
[205,"Jozefína"]
[206,"Judita "]
[207,"Júlia"]
[208,"Juliana"]
[209,"Július "]
[210,"Juraj "]
[211,"Justína"]
[212,"Kamil"]
[213,"Kamila"]
[214,"Karina"]
[215,"Karla"]
[216,"Karol "]
[217,"Karolína "]
[218,"Katarína "]
[219,"Kazimír "]
[220,"Klára"]
[221,"Klaudia"]
[222,"Klement "]
[223,"Kliment "]
[224,"Koloman "]
[225,"Konštantín "]
[226,"Kornel"]
[227,"Kornélia"]
[228,"Kristián"]
[229,"Kristína"]
[230,"Krištof "]
[231,"Kvetoslav"]
[232,"Kvetoslava"]
[233,"Ladislav "]
[234,"Ladislava"]
[235,"Laura"]
[236,"Lea"]
[237,"Lenka "]
[238,"Leonard"]
[239,"Leopold "]
[240,"Leopolda"]
[241,"Lesana"]
[242,"Lesia"]
[243,"Levoslav"]
[244,"Liana "]
[245,"Libor"]
[246,"Libuša "]
[247,"Linda"]
[248,"Lívia"]
[249,"Lolita "]
[250,"Ľubica "]
[251,"Ľubomír"]
[252,"Ľubomíra"]
[253,"Ľubor"]
[254,"Ľuboslav"]
[255,"Ľuboslava"]
[256,"Ľuboš"]
[257,"Lucia "]
[258,"Ľudmila "]
[259,"Ľudomil"]
[260,"Ľudomila"]
[261,"Ľudovít "]
[262,"Lujza"]
[263,"Lukáš "]
[264,"Luna "]
[265,"Lýdia "]
[266,"Magdaléna"]
[267,"Malvína"]
[268,"Marcel"]
[269,"Marcela"]
[270,"Marek "]
[271,"Margaréta "]
[272,"Margita "]
[273,"Mária "]
[274,"Marián "]
[275,"Marianna"]
[276,"Marika"]
[277,"Marína "]
[278,"Mário"]
[279,"Maroš "]
[280,"Marta "]
[281,"Martin "]
[282,"Martina "]
[283,"Matej "]
[284,"Matilda"]
[285,"Matúš"]
[286,"Maximilián"]
[287,"Medard "]
[288,"Melánia"]
[289,"Melichar "]
[290,"Metod"]
[291,"Michaela"]
[292,"Michal "]
[293,"Mikuláš "]
[294,"Milada "]
[295,"Milan "]
[296,"Milena"]
[297,"Milica"]
[298,"Miloslav"]
[299,"Miloslava"]
[300,"Miloš"]
[301,"Milota "]
[302,"Miriama"]
[303,"Miroslav"]
[304,"Miroslava"]
[305,"Mojmír "]
[306,"Monika"]
[307,"Móric "]
[308,"Mutsumi"]
[309,"Nadežda"]
[310,"Natália"]
[311,"Nataša"]
[312,"Nathan"]
[313,"Nikola"]
[314,"Nikola"]
[315,"Nina"]
[316,"Nora "]
[317,"Norbert "]
[318,"Odin "]
[319,"Oldrich"]
[320,"Oleg"]
[321,"Oľga"]
[322,"Oliver"]
[323,"Olívia"]
[324,"Olympia "]
[325,"Ondrej "]
[326,"Oskár"]
[327,"Otília"]
[328,"Oto"]
[329,"Oxana"]
[330,"Pankrác "]
[331,"Patrícia"]
[332,"Patrik "]
[333,"Paulína"]
[334,"Pavol "]
[335,"Perla "]
[336,"Peter "]
[337,"Petra "]
[338,"Petrana"]
[339,"Petronela"]
[340,"Pravoslav"]
[341,"Prokop"]
[342,"Radomír"]
[343,"Radoslav"]
[344,"Radoslava"]
[345,"Radovan"]
[346,"Radúz"]
[347,"Rastislav "]
[348,"Rebeka "]
[349,"Regína "]
[350,"Renáta"]
[351,"René"]
[352,"Richard "]
[353,"Rishi"]
[354,"Róbert"]
[355,"Roland"]
[356,"Roman "]
[357,"Romana"]
[358,"Rozália"]
[359,"Rudolf"]
[360,"Ružena"]
[361,"Sabína"]
[362,"Samuel "]
[363,"Sandra "]
[364,"Sára "]
[365,"Saskia"]
[366,"Sebastián"]
[367,"Sergej"]
[368,"Servác"]
[369,"Seth "]
[370,"Severín "]
[371,"Sidónia"]
[372,"Silvester"]
[373,"Silvia"]
[374,"Simona"]
[375,"Sláva"]
[376,"Slávka"]
[377,"Slavomír "]
[378,"Slavomíra"]
[379,"Sofia "]
[380,"Soňa"]
[381,"Stanislav "]
[382,"Stanislava"]
[383,"Stela"]
[384,"Svätopluk "]
[385,"Svetlana"]
[386,"Svetozár"]
[387,"Šarlota"]
[388,"Šimon "]
[389,"Štefan "]
[390,"Štefánia"]
[391,"Tadeáš"]
[392,"Tamara"]
[393,"Tatiana"]
[394,"Teodor "]
[395,"Terézia"]
[396,"Theodora "]
[397,"Tibor"]
[398,"Tiffany "]
[399,"Tichomír"]
{"$rows_left_out":51}