{"text_format":"1","workbook":"xlsx","n_sheets":2,"sheets":["Kalendar","Plánování směn"],"not_rendered":{"charts":0,"images":0,"macros":0,"external_links":0,"defined_names":0,"comments":0,"pivot_tables":0},"unopened":[],"bounds":{"document_bytes":16777216,"sheet_cells":100000,"rows_first":2000,"rows_last":500,"rows_between":2000,"halvings":0,"cell_chars":16384,"cell_head_chars":4096},"cells_cut":0,"cells_raw":0,"read":"whole","date_system":"1900"}

{"sheet":"Kalendar","index":0,"n_rows":9,"n_cols":370,"rows_kept":9,"cut":false,"hidden":false,"merged":[[1,3,2,3],[1,2,2,2],[1,1,2,1]]}
[]
[null,"Směna","Pracovník","Směna + Pracovník","2020-01-01","2020-01-02","2020-01-03","2020-01-04","2020-01-05","2020-01-06","2020-01-07","2020-01-08","2020-01-09","2020-01-10","2020-01-11","2020-01-12","2020-01-13","2020-01-14","2020-01-15","2020-01-16","2020-01-17","2020-01-18","2020-01-19","2020-01-20","2020-01-21","2020-01-22","2020-01-23","2020-01-24","2020-01-25","2020-01-26","2020-01-27","2020-01-28","2020-01-29","2020-01-30","2020-01-31","2020-02-01","2020-02-02","2020-02-03","2020-02-04","2020-02-05","2020-02-06","2020-02-07","2020-02-08","2020-02-09","2020-02-10","2020-02-11","2020-02-12","2020-02-13","2020-02-14","2020-02-15","2020-02-16","2020-02-17","2020-02-18","2020-02-19","2020-02-20","2020-02-21","2020-02-22","2020-02-23","2020-02-24","2020-02-25","2020-02-26","2020-02-27","2020-02-28","2020-02-29","2020-03-01","2020-03-02","2020-03-03","2020-03-04","2020-03-05","2020-03-06","2020-03-07","2020-03-08","2020-03-09","2020-03-10","2020-03-11","2020-03-12","2020-03-13","2020-03-14","2020-03-15","2020-03-16","2020-03-17","2020-03-18","2020-03-19","2020-03-20","2020-03-21","2020-03-22","2020-03-23","2020-03-24","2020-03-25","2020-03-26","2020-03-27","2020-03-28","2020-03-29","2020-03-30","2020-03-31","2020-04-01","2020-04-02","2020-04-03","2020-04-04","2020-04-05","2020-04-06","2020-04-07","2020-04-08","2020-04-09","2020-04-10","2020-04-11","2020-04-12","2020-04-13","2020-04-14","2020-04-15","2020-04-16","2020-04-17","2020-04-18","2020-04-19","2020-04-20","2020-04-21","2020-04-22","2020-04-23","2020-04-24","2020-04-25","2020-04-26","2020-04-27","2020-04-28","2020-04-29","2020-04-30","2020-05-01","2020-05-02","2020-05-03","2020-05-04","2020-05-05","2020-05-06","2020-05-07","2020-05-08","2020-05-09","2020-05-10","2020-05-11","2020-05-12","2020-05-13","2020-05-14","2020-05-15","2020-05-16","2020-05-17","2020-05-18","2020-05-19","2020-05-20","2020-05-21","2020-05-22","2020-05-23","2020-05-24","2020-05-25","2020-05-26","2020-05-27","2020-05-28","2020-05-29","2020-05-30","2020-05-31","2020-06-01","2020-06-02","2020-06-03","2020-06-04","2020-06-05","2020-06-06","2020-06-07","2020-06-08","2020-06-09","2020-06-10","2020-06-11","2020-06-12","2020-06-13","2020-06-14","2020-06-15","2020-06-16","2020-06-17","2020-06-18","2020-06-19","2020-06-20","2020-06-21","2020-06-22","2020-06-23","2020-06-24","2020-06-25","2020-06-26","2020-06-27","2020-06-28","2020-06-29","2020-06-30","2020-07-01","2020-07-02","2020-07-03","2020-07-04","2020-07-05","2020-07-06","2020-07-07","2020-07-08","2020-07-09","2020-07-10","2020-07-11","2020-07-12","2020-07-13","2020-07-14","2020-07-15","2020-07-16","2020-07-17","2020-07-18","2020-07-19","2020-07-20","2020-07-21","2020-07-22","2020-07-23","2020-07-24","2020-07-25","2020-07-26","2020-07-27","2020-07-28","2020-07-29","2020-07-30","2020-07-31","2020-08-01","2020-08-02","2020-08-03","2020-08-04","2020-08-05","2020-08-06","2020-08-07","2020-08-08","2020-08-09","2020-08-10","2020-08-11","2020-08-12","2020-08-13","2020-08-14","2020-08-15","2020-08-16","2020-08-17","2020-08-18","2020-08-19","2020-08-20","2020-08-21","2020-08-22","2020-08-23","2020-08-24","2020-08-25","2020-08-26","2020-08-27","2020-08-28","2020-08-29","2020-08-30","2020-08-31","2020-09-01","2020-09-02","2020-09-03","2020-09-04","2020-09-05","2020-09-06","2020-09-07","2020-09-08","2020-09-09","2020-09-10","2020-09-11","2020-09-12","2020-09-13","2020-09-14","2020-09-15","2020-09-16","2020-09-17","2020-09-18","2020-09-19","2020-09-20","2020-09-21","2020-09-22","2020-09-23","2020-09-24","2020-09-25","2020-09-26","2020-09-27","2020-09-28","2020-09-29","2020-09-30","2020-10-01","2020-10-02","2020-10-03","2020-10-04","2020-10-05","2020-10-06","2020-10-07","2020-10-08","2020-10-09","2020-10-10","2020-10-11","2020-10-12","2020-10-13","2020-10-14","2020-10-15","2020-10-16","2020-10-17","2020-10-18","2020-10-19","2020-10-20","2020-10-21","2020-10-22","2020-10-23","2020-10-24","2020-10-25","2020-10-26","2020-10-27","2020-10-28","2020-10-29","2020-10-30","2020-10-31","2020-11-01","2020-11-02","2020-11-03","2020-11-04","2020-11-05","2020-11-06","2020-11-07","2020-11-08","2020-11-09","2020-11-10","2020-11-11","2020-11-12","2020-11-13","2020-11-14","2020-11-15","2020-11-16","2020-11-17","2020-11-18","2020-11-19","2020-11-20","2020-11-21","2020-11-22","2020-11-23","2020-11-24","2020-11-25","2020-11-26","2020-11-27","2020-11-28","2020-11-29","2020-11-30","2020-12-01","2020-12-02","2020-12-03","2020-12-04","2020-12-05","2020-12-06","2020-12-07","2020-12-08","2020-12-09","2020-12-10","2020-12-11","2020-12-12","2020-12-13","2020-12-14","2020-12-15","2020-12-16","2020-12-17","2020-12-18","2020-12-19","2020-12-20","2020-12-21","2020-12-22","2020-12-23","2020-12-24","2020-12-25","2020-12-26","2020-12-27","2020-12-28","2020-12-29","2020-12-30","2020-12-31"]
[null,null,null,null,"2020-01-01","2020-01-02","2020-01-03","2020-01-04","2020-01-05","2020-01-06","2020-01-07","2020-01-08","2020-01-09","2020-01-10","2020-01-11","2020-01-12","2020-01-13","2020-01-14","2020-01-15","2020-01-16","2020-01-17","2020-01-18","2020-01-19","2020-01-20","2020-01-21","2020-01-22","2020-01-23","2020-01-24","2020-01-25","2020-01-26","2020-01-27","2020-01-28","2020-01-29","2020-01-30","2020-01-31","2020-02-01","2020-02-02","2020-02-03","2020-02-04","2020-02-05","2020-02-06","2020-02-07","2020-02-08","2020-02-09","2020-02-10","2020-02-11","2020-02-12","2020-02-13","2020-02-14","2020-02-15","2020-02-16","2020-02-17","2020-02-18","2020-02-19","2020-02-20","2020-02-21","2020-02-22","2020-02-23","2020-02-24","2020-02-25","2020-02-26","2020-02-27","2020-02-28","2020-02-29","2020-03-01","2020-03-02","2020-03-03","2020-03-04","2020-03-05","2020-03-06","2020-03-07","2020-03-08","2020-03-09","2020-03-10","2020-03-11","2020-03-12","2020-03-13","2020-03-14","2020-03-15","2020-03-16","2020-03-17","2020-03-18","2020-03-19","2020-03-20","2020-03-21","2020-03-22","2020-03-23","2020-03-24","2020-03-25","2020-03-26","2020-03-27","2020-03-28","2020-03-29","2020-03-30","2020-03-31","2020-04-01","2020-04-02","2020-04-03","2020-04-04","2020-04-05","2020-04-06","2020-04-07","2020-04-08","2020-04-09","2020-04-10","2020-04-11","2020-04-12","2020-04-13","2020-04-14","2020-04-15","2020-04-16","2020-04-17","2020-04-18","2020-04-19","2020-04-20","2020-04-21","2020-04-22","2020-04-23","2020-04-24","2020-04-25","2020-04-26","2020-04-27","2020-04-28","2020-04-29","2020-04-30","2020-05-01","2020-05-02","2020-05-03","2020-05-04","2020-05-05","2020-05-06","2020-05-07","2020-05-08","2020-05-09","2020-05-10","2020-05-11","2020-05-12","2020-05-13","2020-05-14","2020-05-15","2020-05-16","2020-05-17","2020-05-18","2020-05-19","2020-05-20","2020-05-21","2020-05-22","2020-05-23","2020-05-24","2020-05-25","2020-05-26","2020-05-27","2020-05-28","2020-05-29","2020-05-30","2020-05-31","2020-06-01","2020-06-02","2020-06-03","2020-06-04","2020-06-05","2020-06-06","2020-06-07","2020-06-08","2020-06-09","2020-06-10","2020-06-11","2020-06-12","2020-06-13","2020-06-14","2020-06-15","2020-06-16","2020-06-17","2020-06-18","2020-06-19","2020-06-20","2020-06-21","2020-06-22","2020-06-23","2020-06-24","2020-06-25","2020-06-26","2020-06-27","2020-06-28","2020-06-29","2020-06-30","2020-07-01","2020-07-02","2020-07-03","2020-07-04","2020-07-05","2020-07-06","2020-07-07","2020-07-08","2020-07-09","2020-07-10","2020-07-11","2020-07-12","2020-07-13","2020-07-14","2020-07-15","2020-07-16","2020-07-17","2020-07-18","2020-07-19","2020-07-20","2020-07-21","2020-07-22","2020-07-23","2020-07-24","2020-07-25","2020-07-26","2020-07-27","2020-07-28","2020-07-29","2020-07-30","2020-07-31","2020-08-01","2020-08-02","2020-08-03","2020-08-04","2020-08-05","2020-08-06","2020-08-07","2020-08-08","2020-08-09","2020-08-10","2020-08-11","2020-08-12","2020-08-13","2020-08-14","2020-08-15","2020-08-16","2020-08-17","2020-08-18","2020-08-19","2020-08-20","2020-08-21","2020-08-22","2020-08-23","2020-08-24","2020-08-25","2020-08-26","2020-08-27","2020-08-28","2020-08-29","2020-08-30","2020-08-31","2020-09-01","2020-09-02","2020-09-03","2020-09-04","2020-09-05","2020-09-06","2020-09-07","2020-09-08","2020-09-09","2020-09-10","2020-09-11","2020-09-12","2020-09-13","2020-09-14","2020-09-15","2020-09-16","2020-09-17","2020-09-18","2020-09-19","2020-09-20","2020-09-21","2020-09-22","2020-09-23","2020-09-24","2020-09-25","2020-09-26","2020-09-27","2020-09-28","2020-09-29","2020-09-30","2020-10-01","2020-10-02","2020-10-03","2020-10-04","2020-10-05","2020-10-06","2020-10-07","2020-10-08","2020-10-09","2020-10-10","2020-10-11","2020-10-12","2020-10-13","2020-10-14","2020-10-15","2020-10-16","2020-10-17","2020-10-18","2020-10-19","2020-10-20","2020-10-21","2020-10-22","2020-10-23","2020-10-24","2020-10-25","2020-10-26","2020-10-27","2020-10-28","2020-10-29","2020-10-30","2020-10-31","2020-11-01","2020-11-02","2020-11-03","2020-11-04","2020-11-05","2020-11-06","2020-11-07","2020-11-08","2020-11-09","2020-11-10","2020-11-11","2020-11-12","2020-11-13","2020-11-14","2020-11-15","2020-11-16","2020-11-17","2020-11-18","2020-11-19","2020-11-20","2020-11-21","2020-11-22","2020-11-23","2020-11-24","2020-11-25","2020-11-26","2020-11-27","2020-11-28","2020-11-29","2020-11-30","2020-12-01","2020-12-02","2020-12-03","2020-12-04","2020-12-05","2020-12-06","2020-12-07","2020-12-08","2020-12-09","2020-12-10","2020-12-11","2020-12-12","2020-12-13","2020-12-14","2020-12-15","2020-12-16","2020-12-17","2020-12-18","2020-12-19","2020-12-20","2020-12-21","2020-12-22","2020-12-23","2020-12-24","2020-12-25","2020-12-26","2020-12-27","2020-12-28","2020-12-29","2020-12-30","2020-12-31"]
[]
[null,"Směna","Pracovník","Směna + Pracovník","01.01.","02.01.","03.01.","04.01.","05.01.","06.01.","07.01.","08.01.","09.01.","10.01.","11.01.","12.01.","13.01.","14.01.","15.01.","16.01.","17.01.","18.01.","19.01.","20.01.","21.01.","22.01.","23.01.","24.01.","25.01.","26.01.","27.01.","28.01.","29.01.","30.01.","31.01.","01.02.","02.02.","03.02.","04.02.","05.02.","06.02.","07.02.","08.02.","09.02.","10.02.","11.02.","12.02.","13.02.","14.02.","15.02.","16.02.","17.02.","18.02.","19.02.","20.02.","21.02.","22.02.","23.02.","24.02.","25.02.","26.02.","27.02.","28.02.","29.02.","01.03.","02.03.","03.03.","04.03.","05.03.","06.03.","07.03.","08.03.","09.03.","10.03.","11.03.","12.03.","13.03.","14.03.","15.03.","16.03.","17.03.","18.03.","19.03.","20.03.","21.03.","22.03.","23.03.","24.03.","25.03.","26.03.","27.03.","28.03.","29.03.","30.03.","31.03.","01.04.","02.04.","03.04.","04.04.","05.04.","06.04.","07.04.","08.04.","09.04.","10.04.","11.04.","12.04.","13.04.","14.04.","15.04.","16.04.","17.04.","18.04.","19.04.","20.04.","21.04.","22.04.","23.04.","24.04.","25.04.","26.04.","27.04.","28.04.","29.04.","30.04.","01.05.","02.05.","03.05.","04.05.","05.05.","06.05.","07.05.","08.05.","09.05.","10.05.","11.05.","12.05.","13.05.","14.05.","15.05.","16.05.","17.05.","18.05.","19.05.","20.05.","21.05.","22.05.","23.05.","24.05.","25.05.","26.05.","27.05.","28.05.","29.05.","30.05.","31.05.","01.06.","02.06.","03.06.","04.06.","05.06.","06.06.","07.06.","08.06.","09.06.","10.06.","11.06.","12.06.","13.06.","14.06.","15.06.","16.06.","17.06.","18.06.","19.06.","20.06.","21.06.","22.06.","23.06.","24.06.","25.06.","26.06.","27.06.","28.06.","29.06.","30.06.","01.07.","02.07.","03.07.","04.07.","05.07.","06.07.","07.07.","08.07.","09.07.","10.07.","11.07.","12.07.","13.07.","14.07.","15.07.","16.07.","17.07.","18.07.","19.07.","20.07.","21.07.","22.07.","23.07.","24.07.","25.07.","26.07.","27.07.","28.07.","29.07.","30.07.","31.07.","01.08.","02.08.","03.08.","04.08.","05.08.","06.08.","07.08.","08.08.","09.08.","10.08.","11.08.","12.08.","13.08.","14.08.","15.08.","16.08.","17.08.","18.08.","19.08.","20.08.","21.08.","22.08.","23.08.","24.08.","25.08.","26.08.","27.08.","28.08.","29.08.","30.08.","31.08.","01.09.","02.09.","03.09.","04.09.","05.09.","06.09.","07.09.","08.09.","09.09.","10.09.","11.09.","12.09.","13.09.","14.09.","15.09.","16.09.","17.09.","18.09.","19.09.","20.09.","21.09.","22.09.","23.09.","24.09.","25.09.","26.09.","27.09.","28.09.","29.09.","30.09.","01.10.","02.10.","03.10.","04.10.","05.10.","06.10.","07.10.","08.10.","09.10.","10.10.","11.10.","12.10.","13.10.","14.10.","15.10.","16.10.","17.10.","18.10.","19.10.","20.10.","21.10.","22.10.","23.10.","24.10.","25.10.","26.10.","27.10.","28.10.","29.10.","30.10.","31.10.","01.11.","02.11.","03.11.","04.11.","05.11.","06.11.","07.11.","08.11.","09.11.","10.11.","11.11.","12.11.","13.11.","14.11.","15.11.","16.11.","17.11.","18.11.","19.11.","20.11.","21.11.","22.11.","23.11.","24.11.","25.11.","26.11.","27.11.","28.11.","29.11.","30.11.","01.12.","02.12.","03.12.","04.12.","05.12.","06.12.","07.12.","08.12.","09.12.","10.12.","11.12.","12.12.","13.12.","14.12.","15.12.","16.12.","17.12.","18.12.","19.12.","20.12.","21.12.","22.12.","23.12.","24.12.","25.12.","26.12.","27.12.","28.12.","29.12.","30.12.","31.12."]
[null,"X - kompletace","Líska Karel",{"$f":"CONCATENATE(Tabulka2[[#This Row],[Směna]],\" - \",Tabulka2[[#This Row],[Pracovník]])","v":"X - kompletace - Líska Karel"},null,null,null,null,1,null,null,null,null,null,1]
[null,"Y -  vulkanizace","Smutná Jana",{"$f":"CONCATENATE(Tabulka2[[#This Row],[Směna]],\" - \",Tabulka2[[#This Row],[Pracovník]])","v":"Y -  vulkanizace - Smutná Jana"},null,null,null,null,null,null,null,1]
[null,"Z -  vulkanizace","Nováková Tereza",{"$f":"CONCATENATE(Tabulka2[[#This Row],[Směna]],\" - \",Tabulka2[[#This Row],[Pracovník]])","v":"Z -  vulkanizace - Nováková Tereza"},null,null,null,null,null,null,null,null,null,null,"nemoc","nemoc","nemoc","nemoc"]
[null,null,"Smutná Jana",{"$f":"CONCATENATE(Tabulka2[[#This Row],[Směna]],\" - \",Tabulka2[[#This Row],[Pracovník]])","v":" - Smutná Jana"},null,null,null,1]

{"sheet":"Plánování směn","index":1,"n_rows":17,"n_cols":7,"rows_kept":17,"cut":false,"hidden":false,"merged":[[0,0,0,2],[0,4,0,6],[10,5,10,6]]}
[]
["Datum","Směna",null,null,"Datum","Směna"]
["2020-01-08","ranní",null,null,"2020-01-11","ranní"]
["Vedoucí","Karel Novák",{"$f":"IF(B4=\"\",\"\",IF(COUNTIFS(Tabulka2[Pracovník],'Plánování směn'!B4,OFFSET(Tabulka2[Pracovník],,MATCH('Plánování směn'!A$3,Kalendar!$E$2:$NF$2,0)+1),\"<>\")=0,\"✔\",\"X\"))","v":"✔"},null,"Vedoucí","Karel Novák",{"$f":"IF(F4=\"\",\"\",IF(COUNTIFS(Tabulka2[Pracovník],'Plánování směn'!F4,OFFSET(Tabulka2[Pracovník],,MATCH('Plánování směn'!E$3,Kalendar!$E$2:$NF$2,0)+1),\"<>\")=0,\"✔\",\"X\"))","v":"✔"}]
[]
[]
[]
[]
[]
[]
["Prádelna","Zaměstanec",null,null,"Prádelna","Zaměstanec"]
[1,"Šofrová Daniela",{"$f":"IF(B12=\"\",\"\",IF(COUNTIFS(Tabulka2[Pracovník],'Plánování směn'!B12,OFFSET(Tabulka2[Pracovník],,MATCH('Plánování směn'!A$3,Kalendar!$E$2:$NF$2,0)+1),\"<>\")=0,\"✔\",\"X\"))","v":"✔"},null,1,"Šofrová Daniela",{"$f":"IF(F12=\"\",\"\",IF(COUNTIFS(Tabulka2[Pracovník],'Plánování směn'!F12,OFFSET(Tabulka2[Pracovník],,MATCH('Plánování směn'!E$3,Kalendar!$E$2:$NF$2,0)+1),\"<>\")=0,\"✔\",\"X\"))","v":"✔"}]
[{"$f":"A12+1","v":2},"Líska Karel",{"$f":"IF(B13=\"\",\"\",IF(COUNTIFS(Tabulka2[Pracovník],'Plánování směn'!B13,OFFSET(Tabulka2[Pracovník],,MATCH('Plánování směn'!A$3,Kalendar!$E$2:$NF$2,0)+1),\"<>\")=0,\"✔\",\"X\"))","v":"✔"},null,{"$f":"E12+1","v":2},"Líska Karel",{"$f":"IF(F13=\"\",\"\",IF(COUNTIFS(Tabulka2[Pracovník],'Plánování směn'!F13,OFFSET(Tabulka2[Pracovník],,MATCH('Plánování směn'!E$3,Kalendar!$E$2:$NF$2,0)+1),\"<>\")=0,\"✔\",\"X\"))","v":"X"}]
[{"$f":"A13+1","v":3},"Smutná Jana",{"$f":"IF(B14=\"\",\"\",IF(COUNTIFS(Tabulka2[Pracovník],'Plánování směn'!B14,OFFSET(Tabulka2[Pracovník],,MATCH('Plánování směn'!A$3,Kalendar!$E$2:$NF$2,0)+1),\"<>\")=0,\"✔\",\"X\"))","v":"X"},null,{"$f":"E13+1","v":3},"Smutná Jana",{"$f":"IF(F14=\"\",\"\",IF(COUNTIFS(Tabulka2[Pracovník],'Plánování směn'!F14,OFFSET(Tabulka2[Pracovník],,MATCH('Plánování směn'!E$3,Kalendar!$E$2:$NF$2,0)+1),\"<>\")=0,\"✔\",\"X\"))","v":"✔"}]
[4,"Nováková Tereza",{"$f":"IF(B15=\"\",\"\",IF(COUNTIFS(Tabulka2[Pracovník],'Plánování směn'!B15,OFFSET(Tabulka2[Pracovník],,MATCH('Plánování směn'!A$3,Kalendar!$E$2:$NF$2,0)+1),\"<>\")=0,\"✔\",\"X\"))","v":"✔"},null,4,"Nováková Tereza",{"$f":"IF(F15=\"\",\"\",IF(COUNTIFS(Tabulka2[Pracovník],'Plánování směn'!F15,OFFSET(Tabulka2[Pracovník],,MATCH('Plánování směn'!E$3,Kalendar!$E$2:$NF$2,0)+1),\"<>\")=0,\"✔\",\"X\"))","v":"X"}]
[5,null,{"$f":"IF(B16=\"\",\"\",IF(COUNTIFS(Tabulka2[Pracovník],'Plánování směn'!B16,OFFSET(Tabulka2[Pracovník],,MATCH('Plánování směn'!A$3,Kalendar!$E$2:$NF$2,0)+1),\"<>\")=0,\"✔\",\"X\"))","v":""},null,5,null,{"$f":"IF(F16=\"\",\"\",IF(COUNTIFS(Tabulka2[Pracovník],'Plánování směn'!F16,OFFSET(Tabulka2[Pracovník],,MATCH('Plánování směn'!E$3,Kalendar!$E$2:$NF$2,0)+1),\"<>\")=0,\"✔\",\"X\"))","v":""}]
[6,null,{"$f":"IF(B17=\"\",\"\",IF(COUNTIFS(Tabulka2[Pracovník],'Plánování směn'!B17,OFFSET(Tabulka2[Pracovník],,MATCH('Plánování směn'!A$3,Kalendar!$E$2:$NF$2,0)+1),\"<>\")=0,\"✔\",\"X\"))","v":""},null,6,null,{"$f":"IF(F17=\"\",\"\",IF(COUNTIFS(Tabulka2[Pracovník],'Plánování směn'!F17,OFFSET(Tabulka2[Pracovník],,MATCH('Plánování směn'!E$3,Kalendar!$E$2:$NF$2,0)+1),\"<>\")=0,\"✔\",\"X\"))","v":""}]