{"text_format":"1","workbook":"xlsx","n_sheets":3,"sheets":["ZDROJ","Evidencia pošty","Vyhľadávanie"],"not_rendered":{"charts":0,"images":0,"macros":1,"external_links":0,"defined_names":2,"comments":0,"pivot_tables":0},"unopened":[],"bounds":{"document_bytes":16777216,"sheet_cells":100000,"rows_first":2000,"rows_last":500,"rows_between":2000,"halvings":0,"cell_chars":16384,"cell_head_chars":4096},"cells_cut":0,"cells_raw":0,"read":"whole","date_system":"1900"}

{"sheet":"ZDROJ","index":0,"n_rows":3,"n_cols":2,"rows_kept":3,"cut":false,"hidden":false,"merged":[]}
["POŠTA"]
["Došlá pošta","DP "]
["Odoslaná pošta","OP"]

{"sheet":"Evidencia pošty","index":1,"n_rows":4,"n_cols":11,"rows_kept":4,"cut":false,"hidden":false,"merged":[]}
[null,null,"Por. číslo","Dátum","Pošta DP/OP","Meno","Priezvisko","Ulica","Popisné číslo","PSČ","Obec"]
[{"$f":"Tabuľka1[[#This Row],[Priezvisko]]","v":"Nemeth"},null,1,"2018-10-01","DP ","Tibor","Nemeth","Hlavna",100,"04001","Košice"]
[{"$f":"Tabuľka1[[#This Row],[Priezvisko]]","v":"Mrkvicka"},null,2,"2018-10-02","OP","Jan","Mrkvicka","Kvetna",2,"05832","Prešov"]
[{"$f":"Tabuľka1[[#This Row],[Priezvisko]]","v":"Toth"},null,3,"2018-10-02","DP ","Jozef","Toth","Hlavna",100,"04001","Košice"]

{"sheet":"Vyhľadávanie","index":2,"n_rows":3,"n_cols":11,"rows_kept":3,"cut":false,"hidden":false,"merged":[]}
[]
["HĽADAJ podľa priezviska",null,"Por. číslo","Dátum","Pošta odoslaná/došlá","Meno","Priezvisko","Ulica","Popisné číslo","PSČ","Obec"]
["Nemeth",null,{"$f":"VLOOKUP(A3,'Evidencia pošty'!$A$2:$K$150000,3,FALSE)","v":1},{"$f":"VLOOKUP(A3,'Evidencia pošty'!$A$2:$K$150000,4,FALSE)","v":"2018-10-01"},{"$f":"VLOOKUP(A3,'Evidencia pošty'!$A$2:$K$150000,5,FALSE)","v":"DP "},{"$f":"VLOOKUP(A3,'Evidencia pošty'!$A$2:$K$150000,6,FALSE)","v":"Tibor"},{"$f":"VLOOKUP(A3,'Evidencia pošty'!$A$2:$K$150000,7,FALSE)","v":"Nemeth"},{"$f":"VLOOKUP(A3,'Evidencia pošty'!$A$2:$K$150000,8,FALSE)","v":"Hlavna"},{"$f":"VLOOKUP(A3,'Evidencia pošty'!$A$2:$K$150000,9,FALSE)","v":100},{"$f":"VLOOKUP(A3,'Evidencia pošty'!$A$2:$K$150000,10,FALSE)","v":"04001"},{"$f":"VLOOKUP(A3,'Evidencia pošty'!$A$2:$K$150000,11,FALSE)","v":"Košice"}]