{"text_format":"1","workbook":"xlsx","n_sheets":5,"sheets":["Výpočet kapacit","Seznam materiálu","Seznam dílů","Průměry","List1"],"not_rendered":{"charts":0,"images":0,"macros":1,"external_links":0,"defined_names":0,"comments":0,"pivot_tables":0},"unopened":[],"bounds":{"document_bytes":16777216,"sheet_cells":100000,"rows_first":2000,"rows_last":500,"rows_between":2000,"halvings":0,"cell_chars":16384,"cell_head_chars":4096},"cells_cut":0,"cells_raw":0,"read":"whole","date_system":"1900"}

{"sheet":"Výpočet kapacit","index":0,"n_rows":63,"n_cols":9,"rows_kept":63,"cut":false,"hidden":false,"merged":[[2,4,2,6],[2,0,2,1]]}
[null,null,null,null,null,"heslo pro odemčení:","pcmetal"]
["Výpočet  objemu zakázky",null,{"$f":"TODAY()","v":"2018-03-12"}]
["OBJEDNÁVKA - VÝROBNÍ ČAS [h] =",null,{"$f":"CEILING(D63,1)","v":6},null,"SOUPIS MATERIÁLŮ - KLIKNI"]
["Číslo dílce","Název dílce","Množství v objednávce","Výrobní čas včetně nastavení","Jakost materiálu","Průměr/Rozměr","Potřebná délka"]
["PPB-001.04.02",{"$f":"IF(A5=0,\"\",(VLOOKUP(A5,'Seznam dílů'!$A$2:$B$111,2,FALSE)))","v":"vložka"},1,{"$f":"IF(A5=0,0,(C5*VLOOKUP(A5,'Seznam dílů'!$A$2:$C$111,3,FALSE)+2700))","v":2762},{"$f":"IFERROR(VLOOKUP(A5,'Seznam dílů'!A$2:F$101,4,FALSE),0)","v":4301},{"$f":"IFERROR(VLOOKUP(A5,'Seznam dílů'!A$2:E$101,5,FALSE),0)","v":16},{"$f":"IFERROR(C5*((VLOOKUP(A5,'Seznam dílů'!A$2:F$101,6,FALSE)+7)),0)","v":32}]
["PPB-001.06.04",{"$f":"IF(A6=0,\"\",(VLOOKUP(A6,'Seznam dílů'!$A$2:$B$111,2,FALSE)))","v":"čep 1 D8"},2,{"$f":"IF(A6=0,0,(C6*VLOOKUP(A6,'Seznam dílů'!$A$2:$C$111,3,FALSE)+2700))","v":2744},{"$f":"IFERROR(VLOOKUP(A6,'Seznam dílů'!A$2:F$101,4,FALSE),0)","v":4301},{"$f":"IFERROR(VLOOKUP(A6,'Seznam dílů'!A$2:E$101,5,FALSE),0)","v":8},{"$f":"IFERROR(C6*((VLOOKUP(A6,'Seznam dílů'!A$2:F$101,6,FALSE)+7)),0)","v":44}]
["PPB-005.18",{"$f":"IF(A7=0,\"\",(VLOOKUP(A7,'Seznam dílů'!$A$2:$B$111,2,FALSE)))","v":"čep hladký s drážkami"},3,{"$f":"IF(A7=0,0,(C7*VLOOKUP(A7,'Seznam dílů'!$A$2:$C$111,3,FALSE)+2700))","v":2811},{"$f":"IFERROR(VLOOKUP(A7,'Seznam dílů'!A$2:F$101,4,FALSE),0)","v":4305},{"$f":"IFERROR(VLOOKUP(A7,'Seznam dílů'!A$2:E$101,5,FALSE),0)","v":10},{"$f":"IFERROR(C7*((VLOOKUP(A7,'Seznam dílů'!A$2:F$101,6,FALSE)+7)),0)","v":213}]
["PPB-001.10.04 b",{"$f":"IF(A8=0,\"\",(VLOOKUP(A8,'Seznam dílů'!$A$2:$B$111,2,FALSE)))","v":"dorazový čep 2"},4,{"$f":"IF(A8=0,0,(C8*VLOOKUP(A8,'Seznam dílů'!$A$2:$C$111,3,FALSE)+2700))","v":2800},{"$f":"IFERROR(VLOOKUP(A8,'Seznam dílů'!A$2:F$101,4,FALSE),0)","v":4301},{"$f":"IFERROR(VLOOKUP(A8,'Seznam dílů'!A$2:E$101,5,FALSE),0)","v":10},{"$f":"IFERROR(C8*((VLOOKUP(A8,'Seznam dílů'!A$2:F$101,6,FALSE)+7)),0)","v":116}]
["PPB-019",{"$f":"IF(A9=0,\"\",(VLOOKUP(A9,'Seznam dílů'!$A$2:$B$111,2,FALSE)))","v":"čep hlavní"},5,{"$f":"IF(A9=0,0,(C9*VLOOKUP(A9,'Seznam dílů'!$A$2:$C$111,3,FALSE)+2700))","v":2850},{"$f":"IFERROR(VLOOKUP(A9,'Seznam dílů'!A$2:F$101,4,FALSE),0)","v":4305},{"$f":"IFERROR(VLOOKUP(A9,'Seznam dílů'!A$2:E$101,5,FALSE),0)","v":15},{"$f":"IFERROR(C9*((VLOOKUP(A9,'Seznam dílů'!A$2:F$101,6,FALSE)+7)),0)","v":340}]
["PPB-001.10.05",{"$f":"IF(A10=0,\"\",(VLOOKUP(A10,'Seznam dílů'!$A$2:$B$111,2,FALSE)))","v":"trubka"},6,{"$f":"IF(A10=0,0,(C10*VLOOKUP(A10,'Seznam dílů'!$A$2:$C$111,3,FALSE)+2700))","v":3720},{"$f":"IFERROR(VLOOKUP(A10,'Seznam dílů'!A$2:F$101,4,FALSE),0)","v":11373},{"$f":"IFERROR(VLOOKUP(A10,'Seznam dílů'!A$2:E$101,5,FALSE),0)","v":"45x5"},{"$f":"IFERROR(C10*((VLOOKUP(A10,'Seznam dílů'!A$2:F$101,6,FALSE)+7)),0)","v":642}]
["PPB-007.11",{"$f":"IF(A11=0,\"\",(VLOOKUP(A11,'Seznam dílů'!$A$2:$B$111,2,FALSE)))","v":"čep aretace nohy"},7,{"$f":"IF(A11=0,0,(C11*VLOOKUP(A11,'Seznam dílů'!$A$2:$C$111,3,FALSE)+2700))","v":2868},{"$f":"IFERROR(VLOOKUP(A11,'Seznam dílů'!A$2:F$101,4,FALSE),0)","v":4301},{"$f":"IFERROR(VLOOKUP(A11,'Seznam dílů'!A$2:E$101,5,FALSE),0)","v":10},{"$f":"IFERROR(C11*((VLOOKUP(A11,'Seznam dílů'!A$2:F$101,6,FALSE)+7)),0)","v":231}]
[null,{"$f":"IF(A12=0,\"\",(VLOOKUP(A12,'Seznam dílů'!$A$2:$B$111,2,FALSE)))","v":""},null,{"$f":"IF(A12=0,0,(C12*VLOOKUP(A12,'Seznam dílů'!$A$2:$C$111,3,FALSE)+2700))","v":0},{"$f":"IFERROR(VLOOKUP(A12,'Seznam dílů'!A$2:F$101,4,FALSE),0)","v":0},{"$f":"IFERROR(VLOOKUP(A12,'Seznam dílů'!A$2:E$101,5,FALSE),0)","v":0},{"$f":"IFERROR(C12*((VLOOKUP(A12,'Seznam dílů'!A$2:F$101,6,FALSE)+7)),0)","v":0}]
[null,{"$f":"IF(A13=0,\"\",(VLOOKUP(A13,'Seznam dílů'!$A$2:$B$111,2,FALSE)))","v":""},null,{"$f":"IF(A13=0,0,(C13*VLOOKUP(A13,'Seznam dílů'!$A$2:$C$111,3,FALSE)+2700))","v":0},{"$f":"IFERROR(VLOOKUP(A13,'Seznam dílů'!A$2:F$101,4,FALSE),0)","v":0},{"$f":"IFERROR(VLOOKUP(A13,'Seznam dílů'!A$2:E$101,5,FALSE),0)","v":0},{"$f":"IFERROR(C13*((VLOOKUP(A13,'Seznam dílů'!A$2:F$101,6,FALSE)+7)),0)","v":0}]
[null,{"$f":"IF(A14=0,\"\",(VLOOKUP(A14,'Seznam dílů'!$A$2:$B$111,2,FALSE)))","v":""},null,{"$f":"IF(A14=0,0,(C14*VLOOKUP(A14,'Seznam dílů'!$A$2:$C$111,3,FALSE)+2700))","v":0},{"$f":"IFERROR(VLOOKUP(A14,'Seznam dílů'!A$2:F$101,4,FALSE),0)","v":0},{"$f":"IFERROR(VLOOKUP(A14,'Seznam dílů'!A$2:E$101,5,FALSE),0)","v":0},{"$f":"IFERROR(C14*((VLOOKUP(A14,'Seznam dílů'!A$2:F$101,6,FALSE)+7)),0)","v":0}]
[null,{"$f":"IF(A15=0,\"\",(VLOOKUP(A15,'Seznam dílů'!$A$2:$B$111,2,FALSE)))","v":""},null,{"$f":"IF(A15=0,0,(C15*VLOOKUP(A15,'Seznam dílů'!$A$2:$C$111,3,FALSE)+2700))","v":0},{"$f":"IFERROR(VLOOKUP(A15,'Seznam dílů'!A$2:F$101,4,FALSE),0)","v":0},{"$f":"IFERROR(VLOOKUP(A15,'Seznam dílů'!A$2:E$101,5,FALSE),0)","v":0},{"$f":"IFERROR(C15*((VLOOKUP(A15,'Seznam dílů'!A$2:F$101,6,FALSE)+7)),0)","v":0}]
[null,{"$f":"IF(A16=0,\"\",(VLOOKUP(A16,'Seznam dílů'!$A$2:$B$111,2,FALSE)))","v":""},null,{"$f":"IF(A16=0,0,(C16*VLOOKUP(A16,'Seznam dílů'!$A$2:$C$111,3,FALSE)+2700))","v":0},{"$f":"IFERROR(VLOOKUP(A16,'Seznam dílů'!A$2:F$101,4,FALSE),0)","v":0},{"$f":"IFERROR(VLOOKUP(A16,'Seznam dílů'!A$2:E$101,5,FALSE),0)","v":0},{"$f":"IFERROR(C16*((VLOOKUP(A16,'Seznam dílů'!A$2:F$101,6,FALSE)+7)),0)","v":0}]
[null,{"$f":"IF(A17=0,\"\",(VLOOKUP(A17,'Seznam dílů'!$A$2:$B$111,2,FALSE)))","v":""},null,{"$f":"IF(A17=0,0,(C17*VLOOKUP(A17,'Seznam dílů'!$A$2:$C$111,3,FALSE)+2700))","v":0},{"$f":"IFERROR(VLOOKUP(A17,'Seznam dílů'!A$2:F$101,4,FALSE),0)","v":0},{"$f":"IFERROR(VLOOKUP(A17,'Seznam dílů'!A$2:E$101,5,FALSE),0)","v":0},{"$f":"IFERROR(C17*((VLOOKUP(A17,'Seznam dílů'!A$2:F$101,6,FALSE)+7)),0)","v":0},null,"         "]
[null,{"$f":"IF(A18=0,\"\",(VLOOKUP(A18,'Seznam dílů'!$A$2:$B$111,2,FALSE)))","v":""},null,{"$f":"IF(A18=0,0,(C18*VLOOKUP(A18,'Seznam dílů'!$A$2:$C$111,3,FALSE)+2700))","v":0},{"$f":"IFERROR(VLOOKUP(A18,'Seznam dílů'!A$2:F$101,4,FALSE),0)","v":0},{"$f":"IFERROR(VLOOKUP(A18,'Seznam dílů'!A$2:E$101,5,FALSE),0)","v":0},{"$f":"IFERROR(C18*((VLOOKUP(A18,'Seznam dílů'!A$2:F$101,6,FALSE)+7)),0)","v":0}]
[null,{"$f":"IF(A19=0,\"\",(VLOOKUP(A19,'Seznam dílů'!$A$2:$B$111,2,FALSE)))","v":""},null,{"$f":"IF(A19=0,0,(C19*VLOOKUP(A19,'Seznam dílů'!$A$2:$C$111,3,FALSE)+2700))","v":0},{"$f":"IFERROR(VLOOKUP(A19,'Seznam dílů'!A$2:F$101,4,FALSE),0)","v":0},{"$f":"IFERROR(VLOOKUP(A19,'Seznam dílů'!A$2:E$101,5,FALSE),0)","v":0},{"$f":"IFERROR(C19*((VLOOKUP(A19,'Seznam dílů'!A$2:F$101,6,FALSE)+7)),0)","v":0}]
[null,{"$f":"IF(A20=0,\"\",(VLOOKUP(A20,'Seznam dílů'!$A$2:$B$111,2,FALSE)))","v":""},null,{"$f":"IF(A20=0,0,(C20*VLOOKUP(A20,'Seznam dílů'!$A$2:$C$111,3,FALSE)+2700))","v":0},{"$f":"IFERROR(VLOOKUP(A20,'Seznam dílů'!A$2:F$101,4,FALSE),0)","v":0},{"$f":"IFERROR(VLOOKUP(A20,'Seznam dílů'!A$2:E$101,5,FALSE),0)","v":0},{"$f":"IFERROR(C20*((VLOOKUP(A20,'Seznam dílů'!A$2:F$101,6,FALSE)+7)),0)","v":0}]
[null,{"$f":"IF(A21=0,\"\",(VLOOKUP(A21,'Seznam dílů'!$A$2:$B$111,2,FALSE)))","v":""},null,{"$f":"IF(A21=0,0,(C21*VLOOKUP(A21,'Seznam dílů'!$A$2:$C$111,3,FALSE)+2700))","v":0},{"$f":"IFERROR(VLOOKUP(A21,'Seznam dílů'!A$2:F$101,4,FALSE),0)","v":0},{"$f":"IFERROR(VLOOKUP(A21,'Seznam dílů'!A$2:E$101,5,FALSE),0)","v":0},{"$f":"IFERROR(C21*((VLOOKUP(A21,'Seznam dílů'!A$2:F$101,6,FALSE)+7)),0)","v":0}]
[null,{"$f":"IF(A22=0,\"\",(VLOOKUP(A22,'Seznam dílů'!$A$2:$B$111,2,FALSE)))","v":""},null,{"$f":"IF(A22=0,0,(C22*VLOOKUP(A22,'Seznam dílů'!$A$2:$C$111,3,FALSE)+2700))","v":0},{"$f":"IFERROR(VLOOKUP(A22,'Seznam dílů'!A$2:F$101,4,FALSE),0)","v":0},{"$f":"IFERROR(VLOOKUP(A22,'Seznam dílů'!A$2:E$101,5,FALSE),0)","v":0},{"$f":"IFERROR(C22*((VLOOKUP(A22,'Seznam dílů'!A$2:F$101,6,FALSE)+7)),0)","v":0}]
[null,{"$f":"IF(A23=0,\"\",(VLOOKUP(A23,'Seznam dílů'!$A$2:$B$111,2,FALSE)))","v":""},null,{"$f":"IF(A23=0,0,(C23*VLOOKUP(A23,'Seznam dílů'!$A$2:$C$111,3,FALSE)+2700))","v":0},{"$f":"IFERROR(VLOOKUP(A23,'Seznam dílů'!A$2:F$101,4,FALSE),0)","v":0},{"$f":"IFERROR(VLOOKUP(A23,'Seznam dílů'!A$2:E$101,5,FALSE),0)","v":0},{"$f":"IFERROR(C23*((VLOOKUP(A23,'Seznam dílů'!A$2:F$101,6,FALSE)+7)),0)","v":0}]
[null,{"$f":"IF(A24=0,\"\",(VLOOKUP(A24,'Seznam dílů'!$A$2:$B$111,2,FALSE)))","v":""},null,{"$f":"IF(A24=0,0,(C24*VLOOKUP(A24,'Seznam dílů'!$A$2:$C$111,3,FALSE)+2700))","v":0},{"$f":"IFERROR(VLOOKUP(A24,'Seznam dílů'!A$2:F$101,4,FALSE),0)","v":0},{"$f":"IFERROR(VLOOKUP(A24,'Seznam dílů'!A$2:E$101,5,FALSE),0)","v":0},{"$f":"IFERROR(C24*((VLOOKUP(A24,'Seznam dílů'!A$2:F$101,6,FALSE)+7)),0)","v":0}]
[null,{"$f":"IF(A25=0,\"\",(VLOOKUP(A25,'Seznam dílů'!$A$2:$B$111,2,FALSE)))","v":""},null,{"$f":"IF(A25=0,0,(C25*VLOOKUP(A25,'Seznam dílů'!$A$2:$C$111,3,FALSE)+2700))","v":0},{"$f":"IFERROR(VLOOKUP(A25,'Seznam dílů'!A$2:F$101,4,FALSE),0)","v":0},{"$f":"IFERROR(VLOOKUP(A25,'Seznam dílů'!A$2:E$101,5,FALSE),0)","v":0},{"$f":"IFERROR(C25*((VLOOKUP(A25,'Seznam dílů'!A$2:F$101,6,FALSE)+7)),0)","v":0}]
[null,{"$f":"IF(A26=0,\"\",(VLOOKUP(A26,'Seznam dílů'!$A$2:$B$111,2,FALSE)))","v":""},null,{"$f":"IF(A26=0,0,(C26*VLOOKUP(A26,'Seznam dílů'!$A$2:$C$111,3,FALSE)+2700))","v":0},{"$f":"IFERROR(VLOOKUP(A26,'Seznam dílů'!A$2:F$101,4,FALSE),0)","v":0},{"$f":"IFERROR(VLOOKUP(A26,'Seznam dílů'!A$2:E$101,5,FALSE),0)","v":0},{"$f":"IFERROR(C26*((VLOOKUP(A26,'Seznam dílů'!A$2:F$101,6,FALSE)+7)),0)","v":0}]
[null,{"$f":"IF(A27=0,\"\",(VLOOKUP(A27,'Seznam dílů'!$A$2:$B$111,2,FALSE)))","v":""},null,{"$f":"IF(A27=0,0,(C27*VLOOKUP(A27,'Seznam dílů'!$A$2:$C$111,3,FALSE)+2700))","v":0},{"$f":"IFERROR(VLOOKUP(A27,'Seznam dílů'!A$2:F$101,4,FALSE),0)","v":0},{"$f":"IFERROR(VLOOKUP(A27,'Seznam dílů'!A$2:E$101,5,FALSE),0)","v":0},{"$f":"IFERROR(C27*((VLOOKUP(A27,'Seznam dílů'!A$2:F$101,6,FALSE)+7)),0)","v":0}]
[null,{"$f":"IF(A28=0,\"\",(VLOOKUP(A28,'Seznam dílů'!$A$2:$B$111,2,FALSE)))","v":""},null,{"$f":"IF(A28=0,0,(C28*VLOOKUP(A28,'Seznam dílů'!$A$2:$C$111,3,FALSE)+2700))","v":0},{"$f":"IFERROR(VLOOKUP(A28,'Seznam dílů'!A$2:F$101,4,FALSE),0)","v":0},{"$f":"IFERROR(VLOOKUP(A28,'Seznam dílů'!A$2:E$101,5,FALSE),0)","v":0},{"$f":"IFERROR(C28*((VLOOKUP(A28,'Seznam dílů'!A$2:F$101,6,FALSE)+7)),0)","v":0}]
[null,{"$f":"IF(A29=0,\"\",(VLOOKUP(A29,'Seznam dílů'!$A$2:$B$111,2,FALSE)))","v":""},null,{"$f":"IF(A29=0,0,(C29*VLOOKUP(A29,'Seznam dílů'!$A$2:$C$111,3,FALSE)+2700))","v":0},{"$f":"IFERROR(VLOOKUP(A29,'Seznam dílů'!A$2:F$101,4,FALSE),0)","v":0},{"$f":"IFERROR(VLOOKUP(A29,'Seznam dílů'!A$2:E$101,5,FALSE),0)","v":0},{"$f":"IFERROR(C29*((VLOOKUP(A29,'Seznam dílů'!A$2:F$101,6,FALSE)+7)),0)","v":0}]
[null,{"$f":"IF(A30=0,\"\",(VLOOKUP(A30,'Seznam dílů'!$A$2:$B$111,2,FALSE)))","v":""},null,{"$f":"IF(A30=0,0,(C30*VLOOKUP(A30,'Seznam dílů'!$A$2:$C$111,3,FALSE)+2700))","v":0},{"$f":"IFERROR(VLOOKUP(A30,'Seznam dílů'!A$2:F$101,4,FALSE),0)","v":0},{"$f":"IFERROR(VLOOKUP(A30,'Seznam dílů'!A$2:E$101,5,FALSE),0)","v":0},{"$f":"IFERROR(C30*((VLOOKUP(A30,'Seznam dílů'!A$2:F$101,6,FALSE)+7)),0)","v":0}]
[null,{"$f":"IF(A31=0,\"\",(VLOOKUP(A31,'Seznam dílů'!$A$2:$B$111,2,FALSE)))","v":""},null,{"$f":"IF(A31=0,0,(C31*VLOOKUP(A31,'Seznam dílů'!$A$2:$C$111,3,FALSE)+2700))","v":0},{"$f":"IFERROR(VLOOKUP(A31,'Seznam dílů'!A$2:F$101,4,FALSE),0)","v":0},{"$f":"IFERROR(VLOOKUP(A31,'Seznam dílů'!A$2:E$101,5,FALSE),0)","v":0},{"$f":"IFERROR(C31*((VLOOKUP(A31,'Seznam dílů'!A$2:F$101,6,FALSE)+7)),0)","v":0}]
[null,{"$f":"IF(A32=0,\"\",(VLOOKUP(A32,'Seznam dílů'!$A$2:$B$111,2,FALSE)))","v":""},null,{"$f":"IF(A32=0,0,(C32*VLOOKUP(A32,'Seznam dílů'!$A$2:$C$111,3,FALSE)+2700))","v":0},{"$f":"IFERROR(VLOOKUP(A32,'Seznam dílů'!A$2:F$101,4,FALSE),0)","v":0},{"$f":"IFERROR(VLOOKUP(A32,'Seznam dílů'!A$2:E$101,5,FALSE),0)","v":0},{"$f":"IFERROR(C32*((VLOOKUP(A32,'Seznam dílů'!A$2:F$101,6,FALSE)+7)),0)","v":0}]
[null,{"$f":"IF(A33=0,\"\",(VLOOKUP(A33,'Seznam dílů'!$A$2:$B$111,2,FALSE)))","v":""},null,{"$f":"IF(A33=0,0,(C33*VLOOKUP(A33,'Seznam dílů'!$A$2:$C$111,3,FALSE)+2700))","v":0},{"$f":"IFERROR(VLOOKUP(A33,'Seznam dílů'!A$2:F$101,4,FALSE),0)","v":0},{"$f":"IFERROR(VLOOKUP(A33,'Seznam dílů'!A$2:E$101,5,FALSE),0)","v":0},{"$f":"IFERROR(C33*((VLOOKUP(A33,'Seznam dílů'!A$2:F$101,6,FALSE)+7)),0)","v":0}]
[null,{"$f":"IF(A34=0,\"\",(VLOOKUP(A34,'Seznam dílů'!$A$2:$B$111,2,FALSE)))","v":""},null,{"$f":"IF(A34=0,0,(C34*VLOOKUP(A34,'Seznam dílů'!$A$2:$C$111,3,FALSE)+2700))","v":0},{"$f":"IFERROR(VLOOKUP(A34,'Seznam dílů'!A$2:F$101,4,FALSE),0)","v":0},{"$f":"IFERROR(VLOOKUP(A34,'Seznam dílů'!A$2:E$101,5,FALSE),0)","v":0},{"$f":"IFERROR(C34*((VLOOKUP(A34,'Seznam dílů'!A$2:F$101,6,FALSE)+7)),0)","v":0}]
[null,{"$f":"IF(A35=0,\"\",(VLOOKUP(A35,'Seznam dílů'!$A$2:$B$111,2,FALSE)))","v":""},null,{"$f":"IF(A35=0,0,(C35*VLOOKUP(A35,'Seznam dílů'!$A$2:$C$111,3,FALSE)+2700))","v":0},{"$f":"IFERROR(VLOOKUP(A35,'Seznam dílů'!A$2:F$101,4,FALSE),0)","v":0},{"$f":"IFERROR(VLOOKUP(A35,'Seznam dílů'!A$2:E$101,5,FALSE),0)","v":0},{"$f":"IFERROR(C35*((VLOOKUP(A35,'Seznam dílů'!A$2:F$101,6,FALSE)+7)),0)","v":0}]
[null,{"$f":"IF(A36=0,\"\",(VLOOKUP(A36,'Seznam dílů'!$A$2:$B$111,2,FALSE)))","v":""},null,{"$f":"IF(A36=0,0,(C36*VLOOKUP(A36,'Seznam dílů'!$A$2:$C$111,3,FALSE)+2700))","v":0},{"$f":"IFERROR(VLOOKUP(A36,'Seznam dílů'!A$2:F$101,4,FALSE),0)","v":0},{"$f":"IFERROR(VLOOKUP(A36,'Seznam dílů'!A$2:E$101,5,FALSE),0)","v":0},{"$f":"IFERROR(C36*((VLOOKUP(A36,'Seznam dílů'!A$2:F$101,6,FALSE)+7)),0)","v":0}]
[null,{"$f":"IF(A37=0,\"\",(VLOOKUP(A37,'Seznam dílů'!$A$2:$B$111,2,FALSE)))","v":""},null,{"$f":"IF(A37=0,0,(C37*VLOOKUP(A37,'Seznam dílů'!$A$2:$C$111,3,FALSE)+2700))","v":0},{"$f":"IFERROR(VLOOKUP(A37,'Seznam dílů'!A$2:F$101,4,FALSE),0)","v":0},{"$f":"IFERROR(VLOOKUP(A37,'Seznam dílů'!A$2:E$101,5,FALSE),0)","v":0},{"$f":"IFERROR(C37*((VLOOKUP(A37,'Seznam dílů'!A$2:F$101,6,FALSE)+7)),0)","v":0}]
[null,{"$f":"IF(A38=0,\"\",(VLOOKUP(A38,'Seznam dílů'!$A$2:$B$111,2,FALSE)))","v":""},null,{"$f":"IF(A38=0,0,(C38*VLOOKUP(A38,'Seznam dílů'!$A$2:$C$111,3,FALSE)+2700))","v":0},{"$f":"IFERROR(VLOOKUP(A38,'Seznam dílů'!A$2:F$101,4,FALSE),0)","v":0},{"$f":"IFERROR(VLOOKUP(A38,'Seznam dílů'!A$2:E$101,5,FALSE),0)","v":0},{"$f":"IFERROR(C38*((VLOOKUP(A38,'Seznam dílů'!A$2:F$101,6,FALSE)+7)),0)","v":0}]
[null,{"$f":"IF(A39=0,\"\",(VLOOKUP(A39,'Seznam dílů'!$A$2:$B$111,2,FALSE)))","v":""},null,{"$f":"IF(A39=0,0,(C39*VLOOKUP(A39,'Seznam dílů'!$A$2:$C$111,3,FALSE)+2700))","v":0},{"$f":"IFERROR(VLOOKUP(A39,'Seznam dílů'!A$2:F$101,4,FALSE),0)","v":0},{"$f":"IFERROR(VLOOKUP(A39,'Seznam dílů'!A$2:E$101,5,FALSE),0)","v":0},{"$f":"IFERROR(C39*((VLOOKUP(A39,'Seznam dílů'!A$2:F$101,6,FALSE)+7)),0)","v":0}]
[null,{"$f":"IF(A40=0,\"\",(VLOOKUP(A40,'Seznam dílů'!$A$2:$B$111,2,FALSE)))","v":""},null,{"$f":"IF(A40=0,0,(C40*VLOOKUP(A40,'Seznam dílů'!$A$2:$C$111,3,FALSE)+2700))","v":0},{"$f":"IFERROR(VLOOKUP(A40,'Seznam dílů'!A$2:F$101,4,FALSE),0)","v":0},{"$f":"IFERROR(VLOOKUP(A40,'Seznam dílů'!A$2:E$101,5,FALSE),0)","v":0},{"$f":"IFERROR(C40*((VLOOKUP(A40,'Seznam dílů'!A$2:F$101,6,FALSE)+7)),0)","v":0}]
[null,{"$f":"IF(A41=0,\"\",(VLOOKUP(A41,'Seznam dílů'!$A$2:$B$111,2,FALSE)))","v":""},null,{"$f":"IF(A41=0,0,(C41*VLOOKUP(A41,'Seznam dílů'!$A$2:$C$111,3,FALSE)+2700))","v":0},{"$f":"IFERROR(VLOOKUP(A41,'Seznam dílů'!A$2:F$101,4,FALSE),0)","v":0},{"$f":"IFERROR(VLOOKUP(A41,'Seznam dílů'!A$2:E$101,5,FALSE),0)","v":0},{"$f":"IFERROR(C41*((VLOOKUP(A41,'Seznam dílů'!A$2:F$101,6,FALSE)+7)),0)","v":0}]
[null,{"$f":"IF(A42=0,\"\",(VLOOKUP(A42,'Seznam dílů'!$A$2:$B$111,2,FALSE)))","v":""},null,{"$f":"IF(A42=0,0,(C42*VLOOKUP(A42,'Seznam dílů'!$A$2:$C$111,3,FALSE)+2700))","v":0},{"$f":"IFERROR(VLOOKUP(A42,'Seznam dílů'!A$2:F$101,4,FALSE),0)","v":0},{"$f":"IFERROR(VLOOKUP(A42,'Seznam dílů'!A$2:E$101,5,FALSE),0)","v":0},{"$f":"IFERROR(C42*((VLOOKUP(A42,'Seznam dílů'!A$2:F$101,6,FALSE)+7)),0)","v":0}]
[null,{"$f":"IF(A43=0,\"\",(VLOOKUP(A43,'Seznam dílů'!$A$2:$B$111,2,FALSE)))","v":""},null,{"$f":"IF(A43=0,0,(C43*VLOOKUP(A43,'Seznam dílů'!$A$2:$C$111,3,FALSE)+2700))","v":0},{"$f":"IFERROR(VLOOKUP(A43,'Seznam dílů'!A$2:F$101,4,FALSE),0)","v":0},{"$f":"IFERROR(VLOOKUP(A43,'Seznam dílů'!A$2:E$101,5,FALSE),0)","v":0},{"$f":"IFERROR(C43*((VLOOKUP(A43,'Seznam dílů'!A$2:F$101,6,FALSE)+7)),0)","v":0}]
[null,{"$f":"IF(A44=0,\"\",(VLOOKUP(A44,'Seznam dílů'!$A$2:$B$111,2,FALSE)))","v":""},null,{"$f":"IF(A44=0,0,(C44*VLOOKUP(A44,'Seznam dílů'!$A$2:$C$111,3,FALSE)+2700))","v":0},{"$f":"IFERROR(VLOOKUP(A44,'Seznam dílů'!A$2:F$101,4,FALSE),0)","v":0},{"$f":"IFERROR(VLOOKUP(A44,'Seznam dílů'!A$2:E$101,5,FALSE),0)","v":0},{"$f":"IFERROR(C44*((VLOOKUP(A44,'Seznam dílů'!A$2:F$101,6,FALSE)+7)),0)","v":0}]
[null,{"$f":"IF(A45=0,\"\",(VLOOKUP(A45,'Seznam dílů'!$A$2:$B$111,2,FALSE)))","v":""},null,{"$f":"IF(A45=0,0,(C45*VLOOKUP(A45,'Seznam dílů'!$A$2:$C$111,3,FALSE)+2700))","v":0},{"$f":"IFERROR(VLOOKUP(A45,'Seznam dílů'!A$2:F$101,4,FALSE),0)","v":0},{"$f":"IFERROR(VLOOKUP(A45,'Seznam dílů'!A$2:E$101,5,FALSE),0)","v":0},{"$f":"IFERROR(C45*((VLOOKUP(A45,'Seznam dílů'!A$2:F$101,6,FALSE)+7)),0)","v":0}]
[null,{"$f":"IF(A46=0,\"\",(VLOOKUP(A46,'Seznam dílů'!$A$2:$B$111,2,FALSE)))","v":""},null,{"$f":"IF(A46=0,0,(C46*VLOOKUP(A46,'Seznam dílů'!$A$2:$C$111,3,FALSE)+2700))","v":0},{"$f":"IFERROR(VLOOKUP(A46,'Seznam dílů'!A$2:F$101,4,FALSE),0)","v":0},{"$f":"IFERROR(VLOOKUP(A46,'Seznam dílů'!A$2:E$101,5,FALSE),0)","v":0},{"$f":"IFERROR(C46*((VLOOKUP(A46,'Seznam dílů'!A$2:F$101,6,FALSE)+7)),0)","v":0}]
[null,{"$f":"IF(A47=0,\"\",(VLOOKUP(A47,'Seznam dílů'!$A$2:$B$111,2,FALSE)))","v":""},null,{"$f":"IF(A47=0,0,(C47*VLOOKUP(A47,'Seznam dílů'!$A$2:$C$111,3,FALSE)+2700))","v":0},{"$f":"IFERROR(VLOOKUP(A47,'Seznam dílů'!A$2:F$101,4,FALSE),0)","v":0},{"$f":"IFERROR(VLOOKUP(A47,'Seznam dílů'!A$2:E$101,5,FALSE),0)","v":0},{"$f":"IFERROR(C47*((VLOOKUP(A47,'Seznam dílů'!A$2:F$101,6,FALSE)+7)),0)","v":0}]
[null,{"$f":"IF(A48=0,\"\",(VLOOKUP(A48,'Seznam dílů'!$A$2:$B$111,2,FALSE)))","v":""},null,{"$f":"IF(A48=0,0,(C48*VLOOKUP(A48,'Seznam dílů'!$A$2:$C$111,3,FALSE)+2700))","v":0},{"$f":"IFERROR(VLOOKUP(A48,'Seznam dílů'!A$2:F$101,4,FALSE),0)","v":0},{"$f":"IFERROR(VLOOKUP(A48,'Seznam dílů'!A$2:E$101,5,FALSE),0)","v":0},{"$f":"IFERROR(C48*((VLOOKUP(A48,'Seznam dílů'!A$2:F$101,6,FALSE)+7)),0)","v":0}]
[null,{"$f":"IF(A49=0,\"\",(VLOOKUP(A49,'Seznam dílů'!$A$2:$B$111,2,FALSE)))","v":""},null,{"$f":"IF(A49=0,0,(C49*VLOOKUP(A49,'Seznam dílů'!$A$2:$C$111,3,FALSE)+2700))","v":0},{"$f":"IFERROR(VLOOKUP(A49,'Seznam dílů'!A$2:F$101,4,FALSE),0)","v":0},{"$f":"IFERROR(VLOOKUP(A49,'Seznam dílů'!A$2:E$101,5,FALSE),0)","v":0},{"$f":"IFERROR(C49*((VLOOKUP(A49,'Seznam dílů'!A$2:F$101,6,FALSE)+7)),0)","v":0}]
[null,{"$f":"IF(A50=0,\"\",(VLOOKUP(A50,'Seznam dílů'!$A$2:$B$111,2,FALSE)))","v":""},null,{"$f":"IF(A50=0,0,(C50*VLOOKUP(A50,'Seznam dílů'!$A$2:$C$111,3,FALSE)+2700))","v":0},{"$f":"IFERROR(VLOOKUP(A50,'Seznam dílů'!A$2:F$101,4,FALSE),0)","v":0},{"$f":"IFERROR(VLOOKUP(A50,'Seznam dílů'!A$2:E$101,5,FALSE),0)","v":0},{"$f":"IFERROR(C50*((VLOOKUP(A50,'Seznam dílů'!A$2:F$101,6,FALSE)+7)),0)","v":0}]
[null,{"$f":"IF(A51=0,\"\",(VLOOKUP(A51,'Seznam dílů'!$A$2:$B$111,2,FALSE)))","v":""},null,{"$f":"IF(A51=0,0,(C51*VLOOKUP(A51,'Seznam dílů'!$A$2:$C$111,3,FALSE)+2700))","v":0},{"$f":"IFERROR(VLOOKUP(A51,'Seznam dílů'!A$2:F$101,4,FALSE),0)","v":0},{"$f":"IFERROR(VLOOKUP(A51,'Seznam dílů'!A$2:E$101,5,FALSE),0)","v":0},{"$f":"IFERROR(C51*((VLOOKUP(A51,'Seznam dílů'!A$2:F$101,6,FALSE)+7)),0)","v":0}]
[null,{"$f":"IF(A52=0,\"\",(VLOOKUP(A52,'Seznam dílů'!$A$2:$B$111,2,FALSE)))","v":""},null,{"$f":"IF(A52=0,0,(C52*VLOOKUP(A52,'Seznam dílů'!$A$2:$C$111,3,FALSE)+2700))","v":0},{"$f":"IFERROR(VLOOKUP(A52,'Seznam dílů'!A$2:F$101,4,FALSE),0)","v":0},{"$f":"IFERROR(VLOOKUP(A52,'Seznam dílů'!A$2:E$101,5,FALSE),0)","v":0},{"$f":"IFERROR(C52*((VLOOKUP(A52,'Seznam dílů'!A$2:F$101,6,FALSE)+7)),0)","v":0}]
[null,{"$f":"IF(A53=0,\"\",(VLOOKUP(A53,'Seznam dílů'!$A$2:$B$111,2,FALSE)))","v":""},null,{"$f":"IF(A53=0,0,(C53*VLOOKUP(A53,'Seznam dílů'!$A$2:$C$111,3,FALSE)+2700))","v":0},{"$f":"IFERROR(VLOOKUP(A53,'Seznam dílů'!A$2:F$101,4,FALSE),0)","v":0},{"$f":"IFERROR(VLOOKUP(A53,'Seznam dílů'!A$2:E$101,5,FALSE),0)","v":0},{"$f":"IFERROR(C53*((VLOOKUP(A53,'Seznam dílů'!A$2:F$101,6,FALSE)+7)),0)","v":0}]
[null,{"$f":"IF(A54=0,\"\",(VLOOKUP(A54,'Seznam dílů'!$A$2:$B$111,2,FALSE)))","v":""},null,{"$f":"IF(A54=0,0,(C54*VLOOKUP(A54,'Seznam dílů'!$A$2:$C$111,3,FALSE)+2700))","v":0},{"$f":"IFERROR(VLOOKUP(A54,'Seznam dílů'!A$2:F$101,4,FALSE),0)","v":0},{"$f":"IFERROR(VLOOKUP(A54,'Seznam dílů'!A$2:E$101,5,FALSE),0)","v":0},{"$f":"IFERROR(C54*((VLOOKUP(A54,'Seznam dílů'!A$2:F$101,6,FALSE)+7)),0)","v":0}]
[null,{"$f":"IF(A55=0,\"\",(VLOOKUP(A55,'Seznam dílů'!$A$2:$B$111,2,FALSE)))","v":""},null,{"$f":"IF(A55=0,0,(C55*VLOOKUP(A55,'Seznam dílů'!$A$2:$C$111,3,FALSE)+2700))","v":0},{"$f":"IFERROR(VLOOKUP(A55,'Seznam dílů'!A$2:F$101,4,FALSE),0)","v":0},{"$f":"IFERROR(VLOOKUP(A55,'Seznam dílů'!A$2:E$101,5,FALSE),0)","v":0},{"$f":"IFERROR(C55*((VLOOKUP(A55,'Seznam dílů'!A$2:F$101,6,FALSE)+7)),0)","v":0}]
[null,{"$f":"IF(A56=0,\"\",(VLOOKUP(A56,'Seznam dílů'!$A$2:$B$111,2,FALSE)))","v":""},null,{"$f":"IF(A56=0,0,(C56*VLOOKUP(A56,'Seznam dílů'!$A$2:$C$111,3,FALSE)+2700))","v":0},{"$f":"IFERROR(VLOOKUP(A56,'Seznam dílů'!A$2:F$101,4,FALSE),0)","v":0},{"$f":"IFERROR(VLOOKUP(A56,'Seznam dílů'!A$2:E$101,5,FALSE),0)","v":0},{"$f":"IFERROR(C56*((VLOOKUP(A56,'Seznam dílů'!A$2:F$101,6,FALSE)+7)),0)","v":0}]
[null,{"$f":"IF(A57=0,\"\",(VLOOKUP(A57,'Seznam dílů'!$A$2:$B$111,2,FALSE)))","v":""},null,{"$f":"IF(A57=0,0,(C57*VLOOKUP(A57,'Seznam dílů'!$A$2:$C$111,3,FALSE)+2700))","v":0},{"$f":"IFERROR(VLOOKUP(A57,'Seznam dílů'!A$2:F$101,4,FALSE),0)","v":0},{"$f":"IFERROR(VLOOKUP(A57,'Seznam dílů'!A$2:E$101,5,FALSE),0)","v":0},{"$f":"IFERROR(C57*((VLOOKUP(A57,'Seznam dílů'!A$2:F$101,6,FALSE)+7)),0)","v":0}]
[null,{"$f":"IF(A58=0,\"\",(VLOOKUP(A58,'Seznam dílů'!$A$2:$B$111,2,FALSE)))","v":""},null,{"$f":"IF(A58=0,0,(C58*VLOOKUP(A58,'Seznam dílů'!$A$2:$C$111,3,FALSE)+2700))","v":0},{"$f":"IFERROR(VLOOKUP(A58,'Seznam dílů'!A$2:F$101,4,FALSE),0)","v":0},{"$f":"IFERROR(VLOOKUP(A58,'Seznam dílů'!A$2:E$101,5,FALSE),0)","v":0},{"$f":"IFERROR(C58*((VLOOKUP(A58,'Seznam dílů'!A$2:F$101,6,FALSE)+7)),0)","v":0}]
[null,{"$f":"IF(A59=0,\"\",(VLOOKUP(A59,'Seznam dílů'!$A$2:$B$111,2,FALSE)))","v":""},null,{"$f":"IF(A59=0,0,(C59*VLOOKUP(A59,'Seznam dílů'!$A$2:$C$111,3,FALSE)+2700))","v":0},{"$f":"IFERROR(VLOOKUP(A59,'Seznam dílů'!A$2:F$101,4,FALSE),0)","v":0},{"$f":"IFERROR(VLOOKUP(A59,'Seznam dílů'!A$2:E$101,5,FALSE),0)","v":0},{"$f":"IFERROR(C59*((VLOOKUP(A59,'Seznam dílů'!A$2:F$101,6,FALSE)+7)),0)","v":0}]
[]
[null,null,"CELKEM (s) :",{"$f":"SUM(D5:D60)","v":20555}]
[null,null,"CELKEM (min):",{"$f":"D61/60","v":342.58333333333331}]
[null,null,"CELKEM (h)",{"$f":"D61/3600","v":5.7097222222222221}]

{"sheet":"Seznam materiálu","index":1,"n_rows":24,"n_cols":23,"rows_kept":24,"cut":false,"hidden":false,"merged":[[2,0,2,1]]}
["Materiál k objednávce číslo:",null,null,null,null,null,"Datum:"]
[]
["ZPĚT NA VÝPOČET KAPACIT - KLIKNI"]
[{"$f":"IFERROR(IF(B4>0,\"Průměr\",0),0)","v":"Průměr"},{"$f":"IF(IFERROR((VLOOKUP(Průměry!A1,'Výpočet kapacit'!E5:E59,1,FALSE)),0)=Průměry!A1,Průměry!A1,IF(IFERROR(VLOOKUP(Průměry!A2,'Výpočet kapacit'!E5:E59,1,FALSE),0)=Průměry!A2,Průměry!A2,IF(IFERROR(VLOOKUP(Průměry!A3,'Výpočet kapacit'!E5:E59,1,FALSE),0)=Průměry!A3,Průměry!A3,IF(IFERROR(VLOOKUP(Průměry!A4,'Výpočet kapacit'!E5:E59,1,FALSE),0)=Průměry!A4,Průměry!A4,IF(IFERROR(VLOOKUP(Průměry!A5,'Výpočet kapacit'!E5:E59,1,FALSE),0)=Průměry!A5,Průměry!A5,IF(IFERROR(VLOOKUP(Průměry!A6,'Výpočet kapacit'!E5:E59,1,FALSE),0)=Průměry!A6,Průměry!A6,IF(IFERROR(VLOOKUP(Průměry!A7,'Výpočet kapacit'!E5:E59,1,FALSE),0)=Průměry!A7,Průměry!A7,IF(IFERROR(VLOOKUP(Průměry!A8,'Výpočet kapacit'!E5:E59,1,FALSE),0)=Průměry!A8,Průměry!A8,IF(IFERROR(VLOOKUP(Průměry!A9,'Výpočet kapacit'!E5:E59,1,FALSE),0)=Průměry!A9,Průměry!A8,0)))))))))","v":4301},null,{"$f":"IFERROR(IF(E4>0,\"Průměr\",0),0)","v":"Průměr"},{"$f":"IF(B4=0,0,IF(Průměry!F3>0,Průměry!F3,IF(Průměry!F4>0,Průměry!F4,IF(Průměry!F5>0,Průměry!F5,IF(Průměry!F6>0,Průměry!F6,IF(Průměry!F7>0,Průměry!F7,IF(Průměry!F8>0,Průměry!F8,IF(Průměry!F9>0,Průměry!F9,IF(Průměry!F10>0,Průměry!F10,0)))))))))","v":4305},null,{"$f":"IFERROR(IF(H4>0,\"Průměr\",0),0)","v":"Průměr"},{"$f":"IF(E4=0,0,IF(Průměry!G3>0,Průměry!G3,IF(Průměry!G4>0,Průměry!G4,IF(Průměry!G5>0,Průměry!G5,IF(Průměry!G6>0,Průměry!G6,IF(Průměry!G7>0,Průměry!G7,IF(Průměry!G8>0,Průměry!G8,IF(Průměry!G9>0,Průměry!G9,0))))))))","v":11373},null,{"$f":"IFERROR(IF(K4>0,\"Průměr\",0),0)","v":0},{"$f":"IF(H4=0,0,IF(Průměry!H3>0,Průměry!H3,IF(Průměry!H4>0,Průměry!H4,IF(Průměry!H5>0,Průměry!H5,IF(Průměry!H6>0,Průměry!H6,IF(Průměry!H7>0,Průměry!H7,IF(Průměry!H8>0,Průměry!H8,0)))))))","v":0},null,{"$f":"IFERROR(IF(N4>0,\"Průměr\",0),0)","v":0},{"$f":"IF(K4=0,0,IF(Průměry!I3>0,Průměry!I3,IF(Průměry!I4>0,Průměry!I4,IF(Průměry!I5>0,Průměry!I5,IF(Průměry!I6>0,Průměry!I6,IF(Průměry!I7>0,Průměry!I7,0))))))","v":0},null,{"$f":"IFERROR(IF(Q4>0,\"Průměr\",0),0)","v":0},{"$f":"IF(N4=0,0,IF(Průměry!J3>0,Průměry!J3,IF(Průměry!J4>0,Průměry!J4,IF(Průměry!J5>0,Průměry!J5,IF(Průměry!J6>0,Průměry!J6,0)))))","v":0},null,{"$f":"IFERROR(IF(T4>0,\"Průměr\",0),0)","v":0},{"$f":"IF(Q4=0,0,IF(Průměry!K3>0,Průměry!K3,IF(Průměry!K4>0,Průměry!K4,IF(Průměry!K5>0,Průměry!K5,0))))","v":0},null,{"$f":"IFERROR(IF(W4>0,\"Průměr\",0),0)","v":0},{"$f":"IF(T4=0,0,Průměry!L3)","v":0}]
[]
[]
[{"$f":"IF(B7>0,\"Jakost\",0)","v":"Jakost"},{"$f":"B4","v":4301},null,{"$f":"IF(E7>0,\"Jakost\",0)","v":"Jakost"},{"$f":"IF(E4=B4,0,E4)","v":4305},null,{"$f":"IF(H7>0,\"Jakost\",0)","v":"Jakost"},{"$f":"IF(H4=E4,0,IF(H4=B4,0,H4))","v":11373},null,{"$f":"IF(K7>0,\"Jakost\",0)","v":0},{"$f":"IF(H7=0,0,IF(K4=E4,0,IF(K4=H4,0,K4)))","v":0},null,{"$f":"IF(N7>0,\"Jakost\",0)","v":0},{"$f":"IF(K7=0,0,IF(N4=H4,0,IF(N4=K4,0,N4)))","v":0},null,{"$f":"IF(Q7>0,\"Jakost\",0)","v":0},{"$f":"IF(N7=0,0,IF(Q4=K4,0,IF(Q4=N4,0,Q4)))","v":0},null,{"$f":"IF(T7>0,\"Jakost\",0)","v":0},{"$f":"IF(Q7=0,0,IF(T4=N4,0,IF(T4=Q4,0,T4)))","v":0},null,{"$f":"IF(W7>0,\"Jakost\",0)","v":0},{"$f":"IF(T7=0,0,IF(W4=Q4,0,IF(W4=T4,0,W4)))","v":0}]
[{"$f":"A4","v":"Průměr"},{"$f":"IF(B4>0,\"Potřebná délka [m]\",0)","v":"Potřebná délka [m]"},null,{"$f":"IF(E7>0,\"Průměr\",0)","v":"Průměr"},{"$f":"IF(E4>0,\"Potřebná délka [m]\",0)","v":"Potřebná délka [m]"},null,{"$f":"IF(H7>0,\"Průměr\",0)","v":"Průměr"},{"$f":"IF(H4>0,\"Potřebná délka [m]\",0)","v":"Potřebná délka [m]"},null,{"$f":"IF(K7>0,\"Průměr\",0)","v":0},{"$f":"IF(K4>0,\"Potřebná délka [m]\",0)","v":0},null,{"$f":"IF(N7>0,\"Průměr\",0)","v":0},{"$f":"IF(N4>0,\"Potřebná délka [m]\",0)","v":0},null,{"$f":"IF(Q7>0,\"Průměr\",0)","v":0},{"$f":"IF(Q4>0,\"Potřebná délka [m]\",0)","v":0},null,{"$f":"IF(T7>0,\"Průměr\",0)","v":0},{"$f":"IF(T4>0,\"Potřebná délka [m]\",0)","v":0},null,{"$f":"IF(W7>0,\"Průměr\",0)","v":0},{"$f":"IF(W4>0,\"Potřebná délka [m]\",0)","v":0}]
[{"$f":"IFERROR(INDEX('Výpočet kapacit'!$F$5:$F$59,MATCH(1,('Výpočet kapacit'!$E$5:$E$59=B$7)*(COUNTIF(A$8:A8,'Výpočet kapacit'!$F$5:$F$59)=0),0)),\"\")","v":16},{"$f":"SUMIFS('Výpočet kapacit'!$G$5:$G$59,'Výpočet kapacit'!$F$5:$F$59,A9,'Výpočet kapacit'!$E$5:$E$59,B$7)/1000","v":3.2000000000000001E-2},null,{"$f":"IFERROR(INDEX('Výpočet kapacit'!$F$5:$F$59,MATCH(1,('Výpočet kapacit'!$E$5:$E$59=E$7)*(COUNTIF(D$8:D8,'Výpočet kapacit'!$F$5:$F$59)=0),0)),\"\")","v":10},{"$f":"SUMIFS('Výpočet kapacit'!$G$5:$G$59,'Výpočet kapacit'!$F$5:$F$59,D9,'Výpočet kapacit'!$E$5:$E$59,E$7)/1000","v":0.21299999999999999},null,{"$f":"IFERROR(INDEX('Výpočet kapacit'!$F$5:$F$59,MATCH(1,('Výpočet kapacit'!$E$5:$E$59=H$7)*(COUNTIF(G$8:G8,'Výpočet kapacit'!$F$5:$F$59)=0),0)),\"\")","v":"45x5"},{"$f":"SUMIFS('Výpočet kapacit'!$G$5:$G$59,'Výpočet kapacit'!$F$5:$F$59,G9,'Výpočet kapacit'!$E$5:$E$59,H$7)/1000","v":0.64200000000000002},null,{"$f":"IFERROR(INDEX('Výpočet kapacit'!$F$5:$F$59,MATCH(1,('Výpočet kapacit'!$E$5:$E$59=K$7)*(COUNTIF(J$8:J8,'Výpočet kapacit'!$F$5:$F$59)=0),0)),\"\")","v":""},{"$f":"SUMIFS('Výpočet kapacit'!$G$5:$G$59,'Výpočet kapacit'!$F$5:$F$59,J9,'Výpočet kapacit'!$E$5:$E$59,K$7)/1000","v":0},null,{"$f":"IFERROR(INDEX('Výpočet kapacit'!$F$5:$F$59,MATCH(1,('Výpočet kapacit'!$E$5:$E$59=N$7)*(COUNTIF(M$8:M8,'Výpočet kapacit'!$F$5:$F$59)=0),0)),\"\")","v":""},{"$f":"SUMIFS('Výpočet kapacit'!$G$5:$G$59,'Výpočet kapacit'!$F$5:$F$59,M9,'Výpočet kapacit'!$E$5:$E$59,N$7)/1000","v":0},null,{"$f":"IFERROR(INDEX('Výpočet kapacit'!$F$5:$F$59,MATCH(1,('Výpočet kapacit'!$E$5:$E$59=Q$7)*(COUNTIF(P$8:P8,'Výpočet kapacit'!$F$5:$F$59)=0),0)),\"\")","v":""},{"$f":"SUMIFS('Výpočet kapacit'!$G$5:$G$59,'Výpočet kapacit'!$F$5:$F$59,P9,'Výpočet kapacit'!$E$5:$E$59,Q$7)/1000","v":0},null,{"$f":"IFERROR(INDEX('Výpočet kapacit'!$F$5:$F$59,MATCH(1,('Výpočet kapacit'!$E$5:$E$59=T$7)*(COUNTIF(S$8:S8,'Výpočet kapacit'!$F$5:$F$59)=0),0)),\"\")","v":""},{"$f":"SUMIFS('Výpočet kapacit'!$G$5:$G$59,'Výpočet kapacit'!$F$5:$F$59,S9,'Výpočet kapacit'!$E$5:$E$59,T$7)/1000","v":0},null,{"$f":"IFERROR(INDEX('Výpočet kapacit'!$F$5:$F$59,MATCH(1,('Výpočet kapacit'!$E$5:$E$59=W$7)*(COUNTIF(V$8:V8,'Výpočet kapacit'!$F$5:$F$59)=0),0)),\"\")","v":""},{"$f":"SUMIFS('Výpočet kapacit'!$G$5:$G$59,'Výpočet kapacit'!$F$5:$F$59,V9,'Výpočet kapacit'!$E$5:$E$59,W$7)/1000","v":0}]
[{"$f":"IFERROR(INDEX('Výpočet kapacit'!$F$5:$F$59,MATCH(1,('Výpočet kapacit'!$E$5:$E$59=B$7)*(COUNTIF(A$8:A9,'Výpočet kapacit'!$F$5:$F$59)=0),0)),\"\")","v":8},{"$f":"SUMIFS('Výpočet kapacit'!$G$5:$G$59,'Výpočet kapacit'!$F$5:$F$59,A10,'Výpočet kapacit'!$E$5:$E$59,B$7)/1000","v":4.3999999999999997E-2},null,{"$f":"IFERROR(INDEX('Výpočet kapacit'!$F$5:$F$59,MATCH(1,('Výpočet kapacit'!$E$5:$E$59=E$7)*(COUNTIF(D$8:D9,'Výpočet kapacit'!$F$5:$F$59)=0),0)),\"\")","v":15},{"$f":"SUMIFS('Výpočet kapacit'!$G$5:$G$59,'Výpočet kapacit'!$F$5:$F$59,D10,'Výpočet kapacit'!$E$5:$E$59,E$7)/1000","v":0.34},null,{"$f":"IFERROR(INDEX('Výpočet kapacit'!$F$5:$F$59,MATCH(1,('Výpočet kapacit'!$E$5:$E$59=H$7)*(COUNTIF(G$8:G9,'Výpočet kapacit'!$F$5:$F$59)=0),0)),\"\")","v":""},{"$f":"SUMIFS('Výpočet kapacit'!$G$5:$G$59,'Výpočet kapacit'!$F$5:$F$59,G10,'Výpočet kapacit'!$E$5:$E$59,H$7)/1000","v":0},null,{"$f":"IFERROR(INDEX('Výpočet kapacit'!$F$5:$F$59,MATCH(1,('Výpočet kapacit'!$E$5:$E$59=K$7)*(COUNTIF(J$8:J9,'Výpočet kapacit'!$F$5:$F$59)=0),0)),\"\")","v":""},{"$f":"SUMIFS('Výpočet kapacit'!$G$5:$G$59,'Výpočet kapacit'!$F$5:$F$59,J10,'Výpočet kapacit'!$E$5:$E$59,K$7)/1000","v":0},null,{"$f":"IFERROR(INDEX('Výpočet kapacit'!$F$5:$F$59,MATCH(1,('Výpočet kapacit'!$E$5:$E$59=N$7)*(COUNTIF(M$8:M9,'Výpočet kapacit'!$F$5:$F$59)=0),0)),\"\")","v":""},{"$f":"SUMIFS('Výpočet kapacit'!$G$5:$G$59,'Výpočet kapacit'!$F$5:$F$59,M10,'Výpočet kapacit'!$E$5:$E$59,N$7)/1000","v":0},null,{"$f":"IFERROR(INDEX('Výpočet kapacit'!$F$5:$F$59,MATCH(1,('Výpočet kapacit'!$E$5:$E$59=Q$7)*(COUNTIF(P$8:P9,'Výpočet kapacit'!$F$5:$F$59)=0),0)),\"\")","v":""},{"$f":"SUMIFS('Výpočet kapacit'!$G$5:$G$59,'Výpočet kapacit'!$F$5:$F$59,P10,'Výpočet kapacit'!$E$5:$E$59,Q$7)/1000","v":0},null,{"$f":"IFERROR(INDEX('Výpočet kapacit'!$F$5:$F$59,MATCH(1,('Výpočet kapacit'!$E$5:$E$59=T$7)*(COUNTIF(S$8:S9,'Výpočet kapacit'!$F$5:$F$59)=0),0)),\"\")","v":""},{"$f":"SUMIFS('Výpočet kapacit'!$G$5:$G$59,'Výpočet kapacit'!$F$5:$F$59,S10,'Výpočet kapacit'!$E$5:$E$59,T$7)/1000","v":0},null,{"$f":"IFERROR(INDEX('Výpočet kapacit'!$F$5:$F$59,MATCH(1,('Výpočet kapacit'!$E$5:$E$59=W$7)*(COUNTIF(V$8:V9,'Výpočet kapacit'!$F$5:$F$59)=0),0)),\"\")","v":""},{"$f":"SUMIFS('Výpočet kapacit'!$G$5:$G$59,'Výpočet kapacit'!$F$5:$F$59,V10,'Výpočet kapacit'!$E$5:$E$59,W$7)/1000","v":0}]
[{"$f":"IFERROR(INDEX('Výpočet kapacit'!$F$5:$F$59,MATCH(1,('Výpočet kapacit'!$E$5:$E$59=B$7)*(COUNTIF(A$8:A10,'Výpočet kapacit'!$F$5:$F$59)=0),0)),\"\")","v":10},{"$f":"SUMIFS('Výpočet kapacit'!$G$5:$G$59,'Výpočet kapacit'!$F$5:$F$59,A11,'Výpočet kapacit'!$E$5:$E$59,B$7)/1000","v":0.34699999999999998},null,{"$f":"IFERROR(INDEX('Výpočet kapacit'!$F$5:$F$59,MATCH(1,('Výpočet kapacit'!$E$5:$E$59=E$7)*(COUNTIF(D$8:D10,'Výpočet kapacit'!$F$5:$F$59)=0),0)),\"\")","v":""},{"$f":"SUMIFS('Výpočet kapacit'!$G$5:$G$59,'Výpočet kapacit'!$F$5:$F$59,D11,'Výpočet kapacit'!$E$5:$E$59,E$7)/1000","v":0},null,{"$f":"IFERROR(INDEX('Výpočet kapacit'!$F$5:$F$59,MATCH(1,('Výpočet kapacit'!$E$5:$E$59=H$7)*(COUNTIF(G$8:G10,'Výpočet kapacit'!$F$5:$F$59)=0),0)),\"\")","v":""},{"$f":"SUMIFS('Výpočet kapacit'!$G$5:$G$59,'Výpočet kapacit'!$F$5:$F$59,G11,'Výpočet kapacit'!$E$5:$E$59,H$7)/1000","v":0},null,{"$f":"IFERROR(INDEX('Výpočet kapacit'!$F$5:$F$59,MATCH(1,('Výpočet kapacit'!$E$5:$E$59=K$7)*(COUNTIF(J$8:J10,'Výpočet kapacit'!$F$5:$F$59)=0),0)),\"\")","v":""},{"$f":"SUMIFS('Výpočet kapacit'!$G$5:$G$59,'Výpočet kapacit'!$F$5:$F$59,J11,'Výpočet kapacit'!$E$5:$E$59,K$7)/1000","v":0},null,{"$f":"IFERROR(INDEX('Výpočet kapacit'!$F$5:$F$59,MATCH(1,('Výpočet kapacit'!$E$5:$E$59=N$7)*(COUNTIF(M$8:M10,'Výpočet kapacit'!$F$5:$F$59)=0),0)),\"\")","v":""},{"$f":"SUMIFS('Výpočet kapacit'!$G$5:$G$59,'Výpočet kapacit'!$F$5:$F$59,M11,'Výpočet kapacit'!$E$5:$E$59,N$7)/1000","v":0},null,{"$f":"IFERROR(INDEX('Výpočet kapacit'!$F$5:$F$59,MATCH(1,('Výpočet kapacit'!$E$5:$E$59=Q$7)*(COUNTIF(P$8:P10,'Výpočet kapacit'!$F$5:$F$59)=0),0)),\"\")","v":""},{"$f":"SUMIFS('Výpočet kapacit'!$G$5:$G$59,'Výpočet kapacit'!$F$5:$F$59,P11,'Výpočet kapacit'!$E$5:$E$59,Q$7)/1000","v":0},null,{"$f":"IFERROR(INDEX('Výpočet kapacit'!$F$5:$F$59,MATCH(1,('Výpočet kapacit'!$E$5:$E$59=T$7)*(COUNTIF(S$8:S10,'Výpočet kapacit'!$F$5:$F$59)=0),0)),\"\")","v":""},{"$f":"SUMIFS('Výpočet kapacit'!$G$5:$G$59,'Výpočet kapacit'!$F$5:$F$59,S11,'Výpočet kapacit'!$E$5:$E$59,T$7)/1000","v":0},null,{"$f":"IFERROR(INDEX('Výpočet kapacit'!$F$5:$F$59,MATCH(1,('Výpočet kapacit'!$E$5:$E$59=W$7)*(COUNTIF(V$8:V10,'Výpočet kapacit'!$F$5:$F$59)=0),0)),\"\")","v":""},{"$f":"SUMIFS('Výpočet kapacit'!$G$5:$G$59,'Výpočet kapacit'!$F$5:$F$59,V11,'Výpočet kapacit'!$E$5:$E$59,W$7)/1000","v":0}]
[{"$f":"IFERROR(INDEX('Výpočet kapacit'!$F$5:$F$59,MATCH(1,('Výpočet kapacit'!$E$5:$E$59=B$7)*(COUNTIF(A$8:A11,'Výpočet kapacit'!$F$5:$F$59)=0),0)),\"\")","v":""},{"$f":"SUMIFS('Výpočet kapacit'!$G$5:$G$59,'Výpočet kapacit'!$F$5:$F$59,A12,'Výpočet kapacit'!$E$5:$E$59,B$7)/1000","v":0},null,{"$f":"IFERROR(INDEX('Výpočet kapacit'!$F$5:$F$59,MATCH(1,('Výpočet kapacit'!$E$5:$E$59=E$7)*(COUNTIF(D$8:D11,'Výpočet kapacit'!$F$5:$F$59)=0),0)),\"\")","v":""},{"$f":"SUMIFS('Výpočet kapacit'!$G$5:$G$59,'Výpočet kapacit'!$F$5:$F$59,D12,'Výpočet kapacit'!$E$5:$E$59,E$7)/1000","v":0},null,{"$f":"IFERROR(INDEX('Výpočet kapacit'!$F$5:$F$59,MATCH(1,('Výpočet kapacit'!$E$5:$E$59=H$7)*(COUNTIF(G$8:G11,'Výpočet kapacit'!$F$5:$F$59)=0),0)),\"\")","v":""},{"$f":"SUMIFS('Výpočet kapacit'!$G$5:$G$59,'Výpočet kapacit'!$F$5:$F$59,G12,'Výpočet kapacit'!$E$5:$E$59,H$7)/1000","v":0},null,{"$f":"IFERROR(INDEX('Výpočet kapacit'!$F$5:$F$59,MATCH(1,('Výpočet kapacit'!$E$5:$E$59=K$7)*(COUNTIF(J$8:J11,'Výpočet kapacit'!$F$5:$F$59)=0),0)),\"\")","v":""},{"$f":"SUMIFS('Výpočet kapacit'!$G$5:$G$59,'Výpočet kapacit'!$F$5:$F$59,J12,'Výpočet kapacit'!$E$5:$E$59,K$7)/1000","v":0},null,{"$f":"IFERROR(INDEX('Výpočet kapacit'!$F$5:$F$59,MATCH(1,('Výpočet kapacit'!$E$5:$E$59=N$7)*(COUNTIF(M$8:M11,'Výpočet kapacit'!$F$5:$F$59)=0),0)),\"\")","v":""},{"$f":"SUMIFS('Výpočet kapacit'!$G$5:$G$59,'Výpočet kapacit'!$F$5:$F$59,M12,'Výpočet kapacit'!$E$5:$E$59,N$7)/1000","v":0},null,{"$f":"IFERROR(INDEX('Výpočet kapacit'!$F$5:$F$59,MATCH(1,('Výpočet kapacit'!$E$5:$E$59=Q$7)*(COUNTIF(P$8:P11,'Výpočet kapacit'!$F$5:$F$59)=0),0)),\"\")","v":""},{"$f":"SUMIFS('Výpočet kapacit'!$G$5:$G$59,'Výpočet kapacit'!$F$5:$F$59,P12,'Výpočet kapacit'!$E$5:$E$59,Q$7)/1000","v":0},null,{"$f":"IFERROR(INDEX('Výpočet kapacit'!$F$5:$F$59,MATCH(1,('Výpočet kapacit'!$E$5:$E$59=T$7)*(COUNTIF(S$8:S11,'Výpočet kapacit'!$F$5:$F$59)=0),0)),\"\")","v":""},{"$f":"SUMIFS('Výpočet kapacit'!$G$5:$G$59,'Výpočet kapacit'!$F$5:$F$59,S12,'Výpočet kapacit'!$E$5:$E$59,T$7)/1000","v":0},null,{"$f":"IFERROR(INDEX('Výpočet kapacit'!$F$5:$F$59,MATCH(1,('Výpočet kapacit'!$E$5:$E$59=W$7)*(COUNTIF(V$8:V11,'Výpočet kapacit'!$F$5:$F$59)=0),0)),\"\")","v":""},{"$f":"SUMIFS('Výpočet kapacit'!$G$5:$G$59,'Výpočet kapacit'!$F$5:$F$59,V12,'Výpočet kapacit'!$E$5:$E$59,W$7)/1000","v":0}]
[{"$f":"IFERROR(INDEX('Výpočet kapacit'!$F$5:$F$59,MATCH(1,('Výpočet kapacit'!$E$5:$E$59=B$7)*(COUNTIF(A$8:A12,'Výpočet kapacit'!$F$5:$F$59)=0),0)),\"\")","v":""},{"$f":"SUMIFS('Výpočet kapacit'!$G$5:$G$59,'Výpočet kapacit'!$F$5:$F$59,A13,'Výpočet kapacit'!$E$5:$E$59,B$7)/1000","v":0},null,{"$f":"IFERROR(INDEX('Výpočet kapacit'!$F$5:$F$59,MATCH(1,('Výpočet kapacit'!$E$5:$E$59=E$7)*(COUNTIF(D$8:D12,'Výpočet kapacit'!$F$5:$F$59)=0),0)),\"\")","v":""},{"$f":"SUMIFS('Výpočet kapacit'!$G$5:$G$59,'Výpočet kapacit'!$F$5:$F$59,D13,'Výpočet kapacit'!$E$5:$E$59,E$7)/1000","v":0},null,{"$f":"IFERROR(INDEX('Výpočet kapacit'!$F$5:$F$59,MATCH(1,('Výpočet kapacit'!$E$5:$E$59=H$7)*(COUNTIF(G$8:G12,'Výpočet kapacit'!$F$5:$F$59)=0),0)),\"\")","v":""},{"$f":"SUMIFS('Výpočet kapacit'!$G$5:$G$59,'Výpočet kapacit'!$F$5:$F$59,G13,'Výpočet kapacit'!$E$5:$E$59,H$7)/1000","v":0},null,{"$f":"IFERROR(INDEX('Výpočet kapacit'!$F$5:$F$59,MATCH(1,('Výpočet kapacit'!$E$5:$E$59=K$7)*(COUNTIF(J$8:J12,'Výpočet kapacit'!$F$5:$F$59)=0),0)),\"\")","v":""},{"$f":"SUMIFS('Výpočet kapacit'!$G$5:$G$59,'Výpočet kapacit'!$F$5:$F$59,J13,'Výpočet kapacit'!$E$5:$E$59,K$7)/1000","v":0},null,{"$f":"IFERROR(INDEX('Výpočet kapacit'!$F$5:$F$59,MATCH(1,('Výpočet kapacit'!$E$5:$E$59=N$7)*(COUNTIF(M$8:M12,'Výpočet kapacit'!$F$5:$F$59)=0),0)),\"\")","v":""},{"$f":"SUMIFS('Výpočet kapacit'!$G$5:$G$59,'Výpočet kapacit'!$F$5:$F$59,M13,'Výpočet kapacit'!$E$5:$E$59,N$7)/1000","v":0},null,{"$f":"IFERROR(INDEX('Výpočet kapacit'!$F$5:$F$59,MATCH(1,('Výpočet kapacit'!$E$5:$E$59=Q$7)*(COUNTIF(P$8:P12,'Výpočet kapacit'!$F$5:$F$59)=0),0)),\"\")","v":""},{"$f":"SUMIFS('Výpočet kapacit'!$G$5:$G$59,'Výpočet kapacit'!$F$5:$F$59,P13,'Výpočet kapacit'!$E$5:$E$59,Q$7)/1000","v":0},null,{"$f":"IFERROR(INDEX('Výpočet kapacit'!$F$5:$F$59,MATCH(1,('Výpočet kapacit'!$E$5:$E$59=T$7)*(COUNTIF(S$8:S12,'Výpočet kapacit'!$F$5:$F$59)=0),0)),\"\")","v":""},{"$f":"SUMIFS('Výpočet kapacit'!$G$5:$G$59,'Výpočet kapacit'!$F$5:$F$59,S13,'Výpočet kapacit'!$E$5:$E$59,T$7)/1000","v":0},null,{"$f":"IFERROR(INDEX('Výpočet kapacit'!$F$5:$F$59,MATCH(1,('Výpočet kapacit'!$E$5:$E$59=W$7)*(COUNTIF(V$8:V12,'Výpočet kapacit'!$F$5:$F$59)=0),0)),\"\")","v":""},{"$f":"SUMIFS('Výpočet kapacit'!$G$5:$G$59,'Výpočet kapacit'!$F$5:$F$59,V13,'Výpočet kapacit'!$E$5:$E$59,W$7)/1000","v":0}]
[{"$f":"IFERROR(INDEX('Výpočet kapacit'!$F$5:$F$59,MATCH(1,('Výpočet kapacit'!$E$5:$E$59=B$7)*(COUNTIF(A$8:A13,'Výpočet kapacit'!$F$5:$F$59)=0),0)),\"\")","v":""},{"$f":"SUMIFS('Výpočet kapacit'!$G$5:$G$59,'Výpočet kapacit'!$F$5:$F$59,A14,'Výpočet kapacit'!$E$5:$E$59,B$7)/1000","v":0},null,{"$f":"IFERROR(INDEX('Výpočet kapacit'!$F$5:$F$59,MATCH(1,('Výpočet kapacit'!$E$5:$E$59=E$7)*(COUNTIF(D$8:D13,'Výpočet kapacit'!$F$5:$F$59)=0),0)),\"\")","v":""},{"$f":"SUMIFS('Výpočet kapacit'!$G$5:$G$59,'Výpočet kapacit'!$F$5:$F$59,D14,'Výpočet kapacit'!$E$5:$E$59,E$7)/1000","v":0},null,{"$f":"IFERROR(INDEX('Výpočet kapacit'!$F$5:$F$59,MATCH(1,('Výpočet kapacit'!$E$5:$E$59=H$7)*(COUNTIF(G$8:G13,'Výpočet kapacit'!$F$5:$F$59)=0),0)),\"\")","v":""},{"$f":"SUMIFS('Výpočet kapacit'!$G$5:$G$59,'Výpočet kapacit'!$F$5:$F$59,G14,'Výpočet kapacit'!$E$5:$E$59,H$7)/1000","v":0},null,{"$f":"IFERROR(INDEX('Výpočet kapacit'!$F$5:$F$59,MATCH(1,('Výpočet kapacit'!$E$5:$E$59=K$7)*(COUNTIF(J$8:J13,'Výpočet kapacit'!$F$5:$F$59)=0),0)),\"\")","v":""},{"$f":"SUMIFS('Výpočet kapacit'!$G$5:$G$59,'Výpočet kapacit'!$F$5:$F$59,J14,'Výpočet kapacit'!$E$5:$E$59,K$7)/1000","v":0},null,{"$f":"IFERROR(INDEX('Výpočet kapacit'!$F$5:$F$59,MATCH(1,('Výpočet kapacit'!$E$5:$E$59=N$7)*(COUNTIF(M$8:M13,'Výpočet kapacit'!$F$5:$F$59)=0),0)),\"\")","v":""},{"$f":"SUMIFS('Výpočet kapacit'!$G$5:$G$59,'Výpočet kapacit'!$F$5:$F$59,M14,'Výpočet kapacit'!$E$5:$E$59,N$7)/1000","v":0},null,{"$f":"IFERROR(INDEX('Výpočet kapacit'!$F$5:$F$59,MATCH(1,('Výpočet kapacit'!$E$5:$E$59=Q$7)*(COUNTIF(P$8:P13,'Výpočet kapacit'!$F$5:$F$59)=0),0)),\"\")","v":""},{"$f":"SUMIFS('Výpočet kapacit'!$G$5:$G$59,'Výpočet kapacit'!$F$5:$F$59,P14,'Výpočet kapacit'!$E$5:$E$59,Q$7)/1000","v":0},null,{"$f":"IFERROR(INDEX('Výpočet kapacit'!$F$5:$F$59,MATCH(1,('Výpočet kapacit'!$E$5:$E$59=T$7)*(COUNTIF(S$8:S13,'Výpočet kapacit'!$F$5:$F$59)=0),0)),\"\")","v":""},{"$f":"SUMIFS('Výpočet kapacit'!$G$5:$G$59,'Výpočet kapacit'!$F$5:$F$59,S14,'Výpočet kapacit'!$E$5:$E$59,T$7)/1000","v":0},null,{"$f":"IFERROR(INDEX('Výpočet kapacit'!$F$5:$F$59,MATCH(1,('Výpočet kapacit'!$E$5:$E$59=W$7)*(COUNTIF(V$8:V13,'Výpočet kapacit'!$F$5:$F$59)=0),0)),\"\")","v":""},{"$f":"SUMIFS('Výpočet kapacit'!$G$5:$G$59,'Výpočet kapacit'!$F$5:$F$59,V14,'Výpočet kapacit'!$E$5:$E$59,W$7)/1000","v":0}]
[{"$f":"IFERROR(INDEX('Výpočet kapacit'!$F$5:$F$59,MATCH(1,('Výpočet kapacit'!$E$5:$E$59=B$7)*(COUNTIF(A$8:A14,'Výpočet kapacit'!$F$5:$F$59)=0),0)),\"\")","v":""},{"$f":"SUMIFS('Výpočet kapacit'!$G$5:$G$59,'Výpočet kapacit'!$F$5:$F$59,A15,'Výpočet kapacit'!$E$5:$E$59,B$7)/1000","v":0},null,{"$f":"IFERROR(INDEX('Výpočet kapacit'!$F$5:$F$59,MATCH(1,('Výpočet kapacit'!$E$5:$E$59=E$7)*(COUNTIF(D$8:D14,'Výpočet kapacit'!$F$5:$F$59)=0),0)),\"\")","v":""},{"$f":"SUMIFS('Výpočet kapacit'!$G$5:$G$59,'Výpočet kapacit'!$F$5:$F$59,D15,'Výpočet kapacit'!$E$5:$E$59,E$7)/1000","v":0},null,{"$f":"IFERROR(INDEX('Výpočet kapacit'!$F$5:$F$59,MATCH(1,('Výpočet kapacit'!$E$5:$E$59=H$7)*(COUNTIF(G$8:G14,'Výpočet kapacit'!$F$5:$F$59)=0),0)),\"\")","v":""},{"$f":"SUMIFS('Výpočet kapacit'!$G$5:$G$59,'Výpočet kapacit'!$F$5:$F$59,G15,'Výpočet kapacit'!$E$5:$E$59,H$7)/1000","v":0},null,{"$f":"IFERROR(INDEX('Výpočet kapacit'!$F$5:$F$59,MATCH(1,('Výpočet kapacit'!$E$5:$E$59=K$7)*(COUNTIF(J$8:J14,'Výpočet kapacit'!$F$5:$F$59)=0),0)),\"\")","v":""},{"$f":"SUMIFS('Výpočet kapacit'!$G$5:$G$59,'Výpočet kapacit'!$F$5:$F$59,J15,'Výpočet kapacit'!$E$5:$E$59,K$7)/1000","v":0},null,{"$f":"IFERROR(INDEX('Výpočet kapacit'!$F$5:$F$59,MATCH(1,('Výpočet kapacit'!$E$5:$E$59=N$7)*(COUNTIF(M$8:M14,'Výpočet kapacit'!$F$5:$F$59)=0),0)),\"\")","v":""},{"$f":"SUMIFS('Výpočet kapacit'!$G$5:$G$59,'Výpočet kapacit'!$F$5:$F$59,M15,'Výpočet kapacit'!$E$5:$E$59,N$7)/1000","v":0},null,{"$f":"IFERROR(INDEX('Výpočet kapacit'!$F$5:$F$59,MATCH(1,('Výpočet kapacit'!$E$5:$E$59=Q$7)*(COUNTIF(P$8:P14,'Výpočet kapacit'!$F$5:$F$59)=0),0)),\"\")","v":""},{"$f":"SUMIFS('Výpočet kapacit'!$G$5:$G$59,'Výpočet kapacit'!$F$5:$F$59,P15,'Výpočet kapacit'!$E$5:$E$59,Q$7)/1000","v":0},null,{"$f":"IFERROR(INDEX('Výpočet kapacit'!$F$5:$F$59,MATCH(1,('Výpočet kapacit'!$E$5:$E$59=T$7)*(COUNTIF(S$8:S14,'Výpočet kapacit'!$F$5:$F$59)=0),0)),\"\")","v":""},{"$f":"SUMIFS('Výpočet kapacit'!$G$5:$G$59,'Výpočet kapacit'!$F$5:$F$59,S15,'Výpočet kapacit'!$E$5:$E$59,T$7)/1000","v":0},null,{"$f":"IFERROR(INDEX('Výpočet kapacit'!$F$5:$F$59,MATCH(1,('Výpočet kapacit'!$E$5:$E$59=W$7)*(COUNTIF(V$8:V14,'Výpočet kapacit'!$F$5:$F$59)=0),0)),\"\")","v":""},{"$f":"SUMIFS('Výpočet kapacit'!$G$5:$G$59,'Výpočet kapacit'!$F$5:$F$59,V15,'Výpočet kapacit'!$E$5:$E$59,W$7)/1000","v":0}]
[{"$f":"IFERROR(INDEX('Výpočet kapacit'!$F$5:$F$59,MATCH(1,('Výpočet kapacit'!$E$5:$E$59=B$7)*(COUNTIF(A$8:A15,'Výpočet kapacit'!$F$5:$F$59)=0),0)),\"\")","v":""},{"$f":"SUMIFS('Výpočet kapacit'!$G$5:$G$59,'Výpočet kapacit'!$F$5:$F$59,A16,'Výpočet kapacit'!$E$5:$E$59,B$7)/1000","v":0},null,{"$f":"IFERROR(INDEX('Výpočet kapacit'!$F$5:$F$59,MATCH(1,('Výpočet kapacit'!$E$5:$E$59=E$7)*(COUNTIF(D$8:D15,'Výpočet kapacit'!$F$5:$F$59)=0),0)),\"\")","v":""},{"$f":"SUMIFS('Výpočet kapacit'!$G$5:$G$59,'Výpočet kapacit'!$F$5:$F$59,D16,'Výpočet kapacit'!$E$5:$E$59,E$7)/1000","v":0},null,{"$f":"IFERROR(INDEX('Výpočet kapacit'!$F$5:$F$59,MATCH(1,('Výpočet kapacit'!$E$5:$E$59=H$7)*(COUNTIF(G$8:G15,'Výpočet kapacit'!$F$5:$F$59)=0),0)),\"\")","v":""},{"$f":"SUMIFS('Výpočet kapacit'!$G$5:$G$59,'Výpočet kapacit'!$F$5:$F$59,G16,'Výpočet kapacit'!$E$5:$E$59,H$7)/1000","v":0},null,{"$f":"IFERROR(INDEX('Výpočet kapacit'!$F$5:$F$59,MATCH(1,('Výpočet kapacit'!$E$5:$E$59=K$7)*(COUNTIF(J$8:J15,'Výpočet kapacit'!$F$5:$F$59)=0),0)),\"\")","v":""},{"$f":"SUMIFS('Výpočet kapacit'!$G$5:$G$59,'Výpočet kapacit'!$F$5:$F$59,J16,'Výpočet kapacit'!$E$5:$E$59,K$7)/1000","v":0},null,{"$f":"IFERROR(INDEX('Výpočet kapacit'!$F$5:$F$59,MATCH(1,('Výpočet kapacit'!$E$5:$E$59=N$7)*(COUNTIF(M$8:M15,'Výpočet kapacit'!$F$5:$F$59)=0),0)),\"\")","v":""},{"$f":"SUMIFS('Výpočet kapacit'!$G$5:$G$59,'Výpočet kapacit'!$F$5:$F$59,M16,'Výpočet kapacit'!$E$5:$E$59,N$7)/1000","v":0},null,{"$f":"IFERROR(INDEX('Výpočet kapacit'!$F$5:$F$59,MATCH(1,('Výpočet kapacit'!$E$5:$E$59=Q$7)*(COUNTIF(P$8:P15,'Výpočet kapacit'!$F$5:$F$59)=0),0)),\"\")","v":""},{"$f":"SUMIFS('Výpočet kapacit'!$G$5:$G$59,'Výpočet kapacit'!$F$5:$F$59,P16,'Výpočet kapacit'!$E$5:$E$59,Q$7)/1000","v":0},null,{"$f":"IFERROR(INDEX('Výpočet kapacit'!$F$5:$F$59,MATCH(1,('Výpočet kapacit'!$E$5:$E$59=T$7)*(COUNTIF(S$8:S15,'Výpočet kapacit'!$F$5:$F$59)=0),0)),\"\")","v":""},{"$f":"SUMIFS('Výpočet kapacit'!$G$5:$G$59,'Výpočet kapacit'!$F$5:$F$59,S16,'Výpočet kapacit'!$E$5:$E$59,T$7)/1000","v":0},null,{"$f":"IFERROR(INDEX('Výpočet kapacit'!$F$5:$F$59,MATCH(1,('Výpočet kapacit'!$E$5:$E$59=W$7)*(COUNTIF(V$8:V15,'Výpočet kapacit'!$F$5:$F$59)=0),0)),\"\")","v":""},{"$f":"SUMIFS('Výpočet kapacit'!$G$5:$G$59,'Výpočet kapacit'!$F$5:$F$59,V16,'Výpočet kapacit'!$E$5:$E$59,W$7)/1000","v":0}]
[{"$f":"IFERROR(INDEX('Výpočet kapacit'!$F$5:$F$59,MATCH(1,('Výpočet kapacit'!$E$5:$E$59=B$7)*(COUNTIF(A$8:A16,'Výpočet kapacit'!$F$5:$F$59)=0),0)),\"\")","v":""},{"$f":"SUMIFS('Výpočet kapacit'!$G$5:$G$59,'Výpočet kapacit'!$F$5:$F$59,A17,'Výpočet kapacit'!$E$5:$E$59,B$7)/1000","v":0},null,{"$f":"IFERROR(INDEX('Výpočet kapacit'!$F$5:$F$59,MATCH(1,('Výpočet kapacit'!$E$5:$E$59=E$7)*(COUNTIF(D$8:D16,'Výpočet kapacit'!$F$5:$F$59)=0),0)),\"\")","v":""},{"$f":"SUMIFS('Výpočet kapacit'!$G$5:$G$59,'Výpočet kapacit'!$F$5:$F$59,D17,'Výpočet kapacit'!$E$5:$E$59,E$7)/1000","v":0},null,{"$f":"IFERROR(INDEX('Výpočet kapacit'!$F$5:$F$59,MATCH(1,('Výpočet kapacit'!$E$5:$E$59=H$7)*(COUNTIF(G$8:G16,'Výpočet kapacit'!$F$5:$F$59)=0),0)),\"\")","v":""},{"$f":"SUMIFS('Výpočet kapacit'!$G$5:$G$59,'Výpočet kapacit'!$F$5:$F$59,G17,'Výpočet kapacit'!$E$5:$E$59,H$7)/1000","v":0},null,{"$f":"IFERROR(INDEX('Výpočet kapacit'!$F$5:$F$59,MATCH(1,('Výpočet kapacit'!$E$5:$E$59=K$7)*(COUNTIF(J$8:J16,'Výpočet kapacit'!$F$5:$F$59)=0),0)),\"\")","v":""},{"$f":"SUMIFS('Výpočet kapacit'!$G$5:$G$59,'Výpočet kapacit'!$F$5:$F$59,J17,'Výpočet kapacit'!$E$5:$E$59,K$7)/1000","v":0},null,{"$f":"IFERROR(INDEX('Výpočet kapacit'!$F$5:$F$59,MATCH(1,('Výpočet kapacit'!$E$5:$E$59=N$7)*(COUNTIF(M$8:M16,'Výpočet kapacit'!$F$5:$F$59)=0),0)),\"\")","v":""},{"$f":"SUMIFS('Výpočet kapacit'!$G$5:$G$59,'Výpočet kapacit'!$F$5:$F$59,M17,'Výpočet kapacit'!$E$5:$E$59,N$7)/1000","v":0},null,{"$f":"IFERROR(INDEX('Výpočet kapacit'!$F$5:$F$59,MATCH(1,('Výpočet kapacit'!$E$5:$E$59=Q$7)*(COUNTIF(P$8:P16,'Výpočet kapacit'!$F$5:$F$59)=0),0)),\"\")","v":""},{"$f":"SUMIFS('Výpočet kapacit'!$G$5:$G$59,'Výpočet kapacit'!$F$5:$F$59,P17,'Výpočet kapacit'!$E$5:$E$59,Q$7)/1000","v":0},null,{"$f":"IFERROR(INDEX('Výpočet kapacit'!$F$5:$F$59,MATCH(1,('Výpočet kapacit'!$E$5:$E$59=T$7)*(COUNTIF(S$8:S16,'Výpočet kapacit'!$F$5:$F$59)=0),0)),\"\")","v":""},{"$f":"SUMIFS('Výpočet kapacit'!$G$5:$G$59,'Výpočet kapacit'!$F$5:$F$59,S17,'Výpočet kapacit'!$E$5:$E$59,T$7)/1000","v":0},null,{"$f":"IFERROR(INDEX('Výpočet kapacit'!$F$5:$F$59,MATCH(1,('Výpočet kapacit'!$E$5:$E$59=W$7)*(COUNTIF(V$8:V16,'Výpočet kapacit'!$F$5:$F$59)=0),0)),\"\")","v":""},{"$f":"SUMIFS('Výpočet kapacit'!$G$5:$G$59,'Výpočet kapacit'!$F$5:$F$59,V17,'Výpočet kapacit'!$E$5:$E$59,W$7)/1000","v":0}]
[{"$f":"IFERROR(INDEX('Výpočet kapacit'!$F$5:$F$59,MATCH(1,('Výpočet kapacit'!$E$5:$E$59=B$7)*(COUNTIF(A$8:A17,'Výpočet kapacit'!$F$5:$F$59)=0),0)),\"\")","v":""},{"$f":"SUMIFS('Výpočet kapacit'!$G$5:$G$59,'Výpočet kapacit'!$F$5:$F$59,A18,'Výpočet kapacit'!$E$5:$E$59,B$7)/1000","v":0},null,{"$f":"IFERROR(INDEX('Výpočet kapacit'!$F$5:$F$59,MATCH(1,('Výpočet kapacit'!$E$5:$E$59=E$7)*(COUNTIF(D$8:D17,'Výpočet kapacit'!$F$5:$F$59)=0),0)),\"\")","v":""},{"$f":"SUMIFS('Výpočet kapacit'!$G$5:$G$59,'Výpočet kapacit'!$F$5:$F$59,D18,'Výpočet kapacit'!$E$5:$E$59,E$7)/1000","v":0},null,{"$f":"IFERROR(INDEX('Výpočet kapacit'!$F$5:$F$59,MATCH(1,('Výpočet kapacit'!$E$5:$E$59=H$7)*(COUNTIF(G$8:G17,'Výpočet kapacit'!$F$5:$F$59)=0),0)),\"\")","v":""},{"$f":"SUMIFS('Výpočet kapacit'!$G$5:$G$59,'Výpočet kapacit'!$F$5:$F$59,G18,'Výpočet kapacit'!$E$5:$E$59,H$7)/1000","v":0},null,{"$f":"IFERROR(INDEX('Výpočet kapacit'!$F$5:$F$59,MATCH(1,('Výpočet kapacit'!$E$5:$E$59=K$7)*(COUNTIF(J$8:J17,'Výpočet kapacit'!$F$5:$F$59)=0),0)),\"\")","v":""},{"$f":"SUMIFS('Výpočet kapacit'!$G$5:$G$59,'Výpočet kapacit'!$F$5:$F$59,J18,'Výpočet kapacit'!$E$5:$E$59,K$7)/1000","v":0},null,{"$f":"IFERROR(INDEX('Výpočet kapacit'!$F$5:$F$59,MATCH(1,('Výpočet kapacit'!$E$5:$E$59=N$7)*(COUNTIF(M$8:M17,'Výpočet kapacit'!$F$5:$F$59)=0),0)),\"\")","v":""},{"$f":"SUMIFS('Výpočet kapacit'!$G$5:$G$59,'Výpočet kapacit'!$F$5:$F$59,M18,'Výpočet kapacit'!$E$5:$E$59,N$7)/1000","v":0},null,{"$f":"IFERROR(INDEX('Výpočet kapacit'!$F$5:$F$59,MATCH(1,('Výpočet kapacit'!$E$5:$E$59=Q$7)*(COUNTIF(P$8:P17,'Výpočet kapacit'!$F$5:$F$59)=0),0)),\"\")","v":""},{"$f":"SUMIFS('Výpočet kapacit'!$G$5:$G$59,'Výpočet kapacit'!$F$5:$F$59,P18,'Výpočet kapacit'!$E$5:$E$59,Q$7)/1000","v":0},null,{"$f":"IFERROR(INDEX('Výpočet kapacit'!$F$5:$F$59,MATCH(1,('Výpočet kapacit'!$E$5:$E$59=T$7)*(COUNTIF(S$8:S17,'Výpočet kapacit'!$F$5:$F$59)=0),0)),\"\")","v":""},{"$f":"SUMIFS('Výpočet kapacit'!$G$5:$G$59,'Výpočet kapacit'!$F$5:$F$59,S18,'Výpočet kapacit'!$E$5:$E$59,T$7)/1000","v":0},null,{"$f":"IFERROR(INDEX('Výpočet kapacit'!$F$5:$F$59,MATCH(1,('Výpočet kapacit'!$E$5:$E$59=W$7)*(COUNTIF(V$8:V17,'Výpočet kapacit'!$F$5:$F$59)=0),0)),\"\")","v":""},{"$f":"SUMIFS('Výpočet kapacit'!$G$5:$G$59,'Výpočet kapacit'!$F$5:$F$59,V18,'Výpočet kapacit'!$E$5:$E$59,W$7)/1000","v":0}]
[{"$f":"IFERROR(INDEX('Výpočet kapacit'!$F$5:$F$59,MATCH(1,('Výpočet kapacit'!$E$5:$E$59=B$7)*(COUNTIF(A$8:A18,'Výpočet kapacit'!$F$5:$F$59)=0),0)),\"\")","v":""},{"$f":"SUMIFS('Výpočet kapacit'!$G$5:$G$59,'Výpočet kapacit'!$F$5:$F$59,A19,'Výpočet kapacit'!$E$5:$E$59,B$7)/1000","v":0},null,{"$f":"IFERROR(INDEX('Výpočet kapacit'!$F$5:$F$59,MATCH(1,('Výpočet kapacit'!$E$5:$E$59=E$7)*(COUNTIF(D$8:D18,'Výpočet kapacit'!$F$5:$F$59)=0),0)),\"\")","v":""},{"$f":"SUMIFS('Výpočet kapacit'!$G$5:$G$59,'Výpočet kapacit'!$F$5:$F$59,D19,'Výpočet kapacit'!$E$5:$E$59,E$7)/1000","v":0},null,{"$f":"IFERROR(INDEX('Výpočet kapacit'!$F$5:$F$59,MATCH(1,('Výpočet kapacit'!$E$5:$E$59=H$7)*(COUNTIF(G$8:G18,'Výpočet kapacit'!$F$5:$F$59)=0),0)),\"\")","v":""},{"$f":"SUMIFS('Výpočet kapacit'!$G$5:$G$59,'Výpočet kapacit'!$F$5:$F$59,G19,'Výpočet kapacit'!$E$5:$E$59,H$7)/1000","v":0},null,{"$f":"IFERROR(INDEX('Výpočet kapacit'!$F$5:$F$59,MATCH(1,('Výpočet kapacit'!$E$5:$E$59=K$7)*(COUNTIF(J$8:J18,'Výpočet kapacit'!$F$5:$F$59)=0),0)),\"\")","v":""},{"$f":"SUMIFS('Výpočet kapacit'!$G$5:$G$59,'Výpočet kapacit'!$F$5:$F$59,J19,'Výpočet kapacit'!$E$5:$E$59,K$7)/1000","v":0},null,{"$f":"IFERROR(INDEX('Výpočet kapacit'!$F$5:$F$59,MATCH(1,('Výpočet kapacit'!$E$5:$E$59=N$7)*(COUNTIF(M$8:M18,'Výpočet kapacit'!$F$5:$F$59)=0),0)),\"\")","v":""},{"$f":"SUMIFS('Výpočet kapacit'!$G$5:$G$59,'Výpočet kapacit'!$F$5:$F$59,M19,'Výpočet kapacit'!$E$5:$E$59,N$7)/1000","v":0},null,{"$f":"IFERROR(INDEX('Výpočet kapacit'!$F$5:$F$59,MATCH(1,('Výpočet kapacit'!$E$5:$E$59=Q$7)*(COUNTIF(P$8:P18,'Výpočet kapacit'!$F$5:$F$59)=0),0)),\"\")","v":""},{"$f":"SUMIFS('Výpočet kapacit'!$G$5:$G$59,'Výpočet kapacit'!$F$5:$F$59,P19,'Výpočet kapacit'!$E$5:$E$59,Q$7)/1000","v":0},null,{"$f":"IFERROR(INDEX('Výpočet kapacit'!$F$5:$F$59,MATCH(1,('Výpočet kapacit'!$E$5:$E$59=T$7)*(COUNTIF(S$8:S18,'Výpočet kapacit'!$F$5:$F$59)=0),0)),\"\")","v":""},{"$f":"SUMIFS('Výpočet kapacit'!$G$5:$G$59,'Výpočet kapacit'!$F$5:$F$59,S19,'Výpočet kapacit'!$E$5:$E$59,T$7)/1000","v":0},null,{"$f":"IFERROR(INDEX('Výpočet kapacit'!$F$5:$F$59,MATCH(1,('Výpočet kapacit'!$E$5:$E$59=W$7)*(COUNTIF(V$8:V18,'Výpočet kapacit'!$F$5:$F$59)=0),0)),\"\")","v":""},{"$f":"SUMIFS('Výpočet kapacit'!$G$5:$G$59,'Výpočet kapacit'!$F$5:$F$59,V19,'Výpočet kapacit'!$E$5:$E$59,W$7)/1000","v":0}]
[{"$f":"IFERROR(INDEX('Výpočet kapacit'!$F$5:$F$59,MATCH(1,('Výpočet kapacit'!$E$5:$E$59=B$7)*(COUNTIF(A$8:A19,'Výpočet kapacit'!$F$5:$F$59)=0),0)),\"\")","v":""},{"$f":"SUMIFS('Výpočet kapacit'!$G$5:$G$59,'Výpočet kapacit'!$F$5:$F$59,A20,'Výpočet kapacit'!$E$5:$E$59,B$7)/1000","v":0},null,{"$f":"IFERROR(INDEX('Výpočet kapacit'!$F$5:$F$59,MATCH(1,('Výpočet kapacit'!$E$5:$E$59=E$7)*(COUNTIF(D$8:D19,'Výpočet kapacit'!$F$5:$F$59)=0),0)),\"\")","v":""},{"$f":"SUMIFS('Výpočet kapacit'!$G$5:$G$59,'Výpočet kapacit'!$F$5:$F$59,D20,'Výpočet kapacit'!$E$5:$E$59,E$7)/1000","v":0},null,{"$f":"IFERROR(INDEX('Výpočet kapacit'!$F$5:$F$59,MATCH(1,('Výpočet kapacit'!$E$5:$E$59=H$7)*(COUNTIF(G$8:G19,'Výpočet kapacit'!$F$5:$F$59)=0),0)),\"\")","v":""},{"$f":"SUMIFS('Výpočet kapacit'!$G$5:$G$59,'Výpočet kapacit'!$F$5:$F$59,G20,'Výpočet kapacit'!$E$5:$E$59,H$7)/1000","v":0},null,{"$f":"IFERROR(INDEX('Výpočet kapacit'!$F$5:$F$59,MATCH(1,('Výpočet kapacit'!$E$5:$E$59=K$7)*(COUNTIF(J$8:J19,'Výpočet kapacit'!$F$5:$F$59)=0),0)),\"\")","v":""},{"$f":"SUMIFS('Výpočet kapacit'!$G$5:$G$59,'Výpočet kapacit'!$F$5:$F$59,J20,'Výpočet kapacit'!$E$5:$E$59,K$7)/1000","v":0},null,{"$f":"IFERROR(INDEX('Výpočet kapacit'!$F$5:$F$59,MATCH(1,('Výpočet kapacit'!$E$5:$E$59=N$7)*(COUNTIF(M$8:M19,'Výpočet kapacit'!$F$5:$F$59)=0),0)),\"\")","v":""},{"$f":"SUMIFS('Výpočet kapacit'!$G$5:$G$59,'Výpočet kapacit'!$F$5:$F$59,M20,'Výpočet kapacit'!$E$5:$E$59,N$7)/1000","v":0},null,{"$f":"IFERROR(INDEX('Výpočet kapacit'!$F$5:$F$59,MATCH(1,('Výpočet kapacit'!$E$5:$E$59=Q$7)*(COUNTIF(P$8:P19,'Výpočet kapacit'!$F$5:$F$59)=0),0)),\"\")","v":""},{"$f":"SUMIFS('Výpočet kapacit'!$G$5:$G$59,'Výpočet kapacit'!$F$5:$F$59,P20,'Výpočet kapacit'!$E$5:$E$59,Q$7)/1000","v":0},null,{"$f":"IFERROR(INDEX('Výpočet kapacit'!$F$5:$F$59,MATCH(1,('Výpočet kapacit'!$E$5:$E$59=T$7)*(COUNTIF(S$8:S19,'Výpočet kapacit'!$F$5:$F$59)=0),0)),\"\")","v":""},{"$f":"SUMIFS('Výpočet kapacit'!$G$5:$G$59,'Výpočet kapacit'!$F$5:$F$59,S20,'Výpočet kapacit'!$E$5:$E$59,T$7)/1000","v":0},null,{"$f":"IFERROR(INDEX('Výpočet kapacit'!$F$5:$F$59,MATCH(1,('Výpočet kapacit'!$E$5:$E$59=W$7)*(COUNTIF(V$8:V19,'Výpočet kapacit'!$F$5:$F$59)=0),0)),\"\")","v":""},{"$f":"SUMIFS('Výpočet kapacit'!$G$5:$G$59,'Výpočet kapacit'!$F$5:$F$59,V20,'Výpočet kapacit'!$E$5:$E$59,W$7)/1000","v":0}]
[{"$f":"IFERROR(INDEX('Výpočet kapacit'!$F$5:$F$59,MATCH(1,('Výpočet kapacit'!$E$5:$E$59=B$7)*(COUNTIF(A$8:A20,'Výpočet kapacit'!$F$5:$F$59)=0),0)),\"\")","v":""},{"$f":"SUMIFS('Výpočet kapacit'!$G$5:$G$59,'Výpočet kapacit'!$F$5:$F$59,A21,'Výpočet kapacit'!$E$5:$E$59,B$7)/1000","v":0},null,{"$f":"IFERROR(INDEX('Výpočet kapacit'!$F$5:$F$59,MATCH(1,('Výpočet kapacit'!$E$5:$E$59=E$7)*(COUNTIF(D$8:D20,'Výpočet kapacit'!$F$5:$F$59)=0),0)),\"\")","v":""},{"$f":"SUMIFS('Výpočet kapacit'!$G$5:$G$59,'Výpočet kapacit'!$F$5:$F$59,D21,'Výpočet kapacit'!$E$5:$E$59,E$7)/1000","v":0},null,{"$f":"IFERROR(INDEX('Výpočet kapacit'!$F$5:$F$59,MATCH(1,('Výpočet kapacit'!$E$5:$E$59=H$7)*(COUNTIF(G$8:G20,'Výpočet kapacit'!$F$5:$F$59)=0),0)),\"\")","v":""},{"$f":"SUMIFS('Výpočet kapacit'!$G$5:$G$59,'Výpočet kapacit'!$F$5:$F$59,G21,'Výpočet kapacit'!$E$5:$E$59,H$7)/1000","v":0},null,{"$f":"IFERROR(INDEX('Výpočet kapacit'!$F$5:$F$59,MATCH(1,('Výpočet kapacit'!$E$5:$E$59=K$7)*(COUNTIF(J$8:J20,'Výpočet kapacit'!$F$5:$F$59)=0),0)),\"\")","v":""},{"$f":"SUMIFS('Výpočet kapacit'!$G$5:$G$59,'Výpočet kapacit'!$F$5:$F$59,J21,'Výpočet kapacit'!$E$5:$E$59,K$7)/1000","v":0},null,{"$f":"IFERROR(INDEX('Výpočet kapacit'!$F$5:$F$59,MATCH(1,('Výpočet kapacit'!$E$5:$E$59=N$7)*(COUNTIF(M$8:M20,'Výpočet kapacit'!$F$5:$F$59)=0),0)),\"\")","v":""},{"$f":"SUMIFS('Výpočet kapacit'!$G$5:$G$59,'Výpočet kapacit'!$F$5:$F$59,M21,'Výpočet kapacit'!$E$5:$E$59,N$7)/1000","v":0},null,{"$f":"IFERROR(INDEX('Výpočet kapacit'!$F$5:$F$59,MATCH(1,('Výpočet kapacit'!$E$5:$E$59=Q$7)*(COUNTIF(P$8:P20,'Výpočet kapacit'!$F$5:$F$59)=0),0)),\"\")","v":""},{"$f":"SUMIFS('Výpočet kapacit'!$G$5:$G$59,'Výpočet kapacit'!$F$5:$F$59,P21,'Výpočet kapacit'!$E$5:$E$59,Q$7)/1000","v":0},null,{"$f":"IFERROR(INDEX('Výpočet kapacit'!$F$5:$F$59,MATCH(1,('Výpočet kapacit'!$E$5:$E$59=T$7)*(COUNTIF(S$8:S20,'Výpočet kapacit'!$F$5:$F$59)=0),0)),\"\")","v":""},{"$f":"SUMIFS('Výpočet kapacit'!$G$5:$G$59,'Výpočet kapacit'!$F$5:$F$59,S21,'Výpočet kapacit'!$E$5:$E$59,T$7)/1000","v":0},null,{"$f":"IFERROR(INDEX('Výpočet kapacit'!$F$5:$F$59,MATCH(1,('Výpočet kapacit'!$E$5:$E$59=W$7)*(COUNTIF(V$8:V20,'Výpočet kapacit'!$F$5:$F$59)=0),0)),\"\")","v":""},{"$f":"SUMIFS('Výpočet kapacit'!$G$5:$G$59,'Výpočet kapacit'!$F$5:$F$59,V21,'Výpočet kapacit'!$E$5:$E$59,W$7)/1000","v":0}]
[{"$f":"IFERROR(INDEX('Výpočet kapacit'!$F$5:$F$59,MATCH(1,('Výpočet kapacit'!$E$5:$E$59=B$7)*(COUNTIF(A$8:A21,'Výpočet kapacit'!$F$5:$F$59)=0),0)),\"\")","v":""},{"$f":"SUMIFS('Výpočet kapacit'!$G$5:$G$59,'Výpočet kapacit'!$F$5:$F$59,A22,'Výpočet kapacit'!$E$5:$E$59,B$7)/1000","v":0},null,{"$f":"IFERROR(INDEX('Výpočet kapacit'!$F$5:$F$59,MATCH(1,('Výpočet kapacit'!$E$5:$E$59=E$7)*(COUNTIF(D$8:D21,'Výpočet kapacit'!$F$5:$F$59)=0),0)),\"\")","v":""},{"$f":"SUMIFS('Výpočet kapacit'!$G$5:$G$59,'Výpočet kapacit'!$F$5:$F$59,D22,'Výpočet kapacit'!$E$5:$E$59,E$7)/1000","v":0},null,{"$f":"IFERROR(INDEX('Výpočet kapacit'!$F$5:$F$59,MATCH(1,('Výpočet kapacit'!$E$5:$E$59=H$7)*(COUNTIF(G$8:G21,'Výpočet kapacit'!$F$5:$F$59)=0),0)),\"\")","v":""},{"$f":"SUMIFS('Výpočet kapacit'!$G$5:$G$59,'Výpočet kapacit'!$F$5:$F$59,G22,'Výpočet kapacit'!$E$5:$E$59,H$7)/1000","v":0},null,{"$f":"IFERROR(INDEX('Výpočet kapacit'!$F$5:$F$59,MATCH(1,('Výpočet kapacit'!$E$5:$E$59=K$7)*(COUNTIF(J$8:J21,'Výpočet kapacit'!$F$5:$F$59)=0),0)),\"\")","v":""},{"$f":"SUMIFS('Výpočet kapacit'!$G$5:$G$59,'Výpočet kapacit'!$F$5:$F$59,J22,'Výpočet kapacit'!$E$5:$E$59,K$7)/1000","v":0},null,{"$f":"IFERROR(INDEX('Výpočet kapacit'!$F$5:$F$59,MATCH(1,('Výpočet kapacit'!$E$5:$E$59=N$7)*(COUNTIF(M$8:M21,'Výpočet kapacit'!$F$5:$F$59)=0),0)),\"\")","v":""},{"$f":"SUMIFS('Výpočet kapacit'!$G$5:$G$59,'Výpočet kapacit'!$F$5:$F$59,M22,'Výpočet kapacit'!$E$5:$E$59,N$7)/1000","v":0},null,{"$f":"IFERROR(INDEX('Výpočet kapacit'!$F$5:$F$59,MATCH(1,('Výpočet kapacit'!$E$5:$E$59=Q$7)*(COUNTIF(P$8:P21,'Výpočet kapacit'!$F$5:$F$59)=0),0)),\"\")","v":""},{"$f":"SUMIFS('Výpočet kapacit'!$G$5:$G$59,'Výpočet kapacit'!$F$5:$F$59,P22,'Výpočet kapacit'!$E$5:$E$59,Q$7)/1000","v":0},null,{"$f":"IFERROR(INDEX('Výpočet kapacit'!$F$5:$F$59,MATCH(1,('Výpočet kapacit'!$E$5:$E$59=T$7)*(COUNTIF(S$8:S21,'Výpočet kapacit'!$F$5:$F$59)=0),0)),\"\")","v":""},{"$f":"SUMIFS('Výpočet kapacit'!$G$5:$G$59,'Výpočet kapacit'!$F$5:$F$59,S22,'Výpočet kapacit'!$E$5:$E$59,T$7)/1000","v":0},null,{"$f":"IFERROR(INDEX('Výpočet kapacit'!$F$5:$F$59,MATCH(1,('Výpočet kapacit'!$E$5:$E$59=W$7)*(COUNTIF(V$8:V21,'Výpočet kapacit'!$F$5:$F$59)=0),0)),\"\")","v":""},{"$f":"SUMIFS('Výpočet kapacit'!$G$5:$G$59,'Výpočet kapacit'!$F$5:$F$59,V22,'Výpočet kapacit'!$E$5:$E$59,W$7)/1000","v":0}]
[{"$f":"IFERROR(INDEX('Výpočet kapacit'!$F$5:$F$59,MATCH(1,('Výpočet kapacit'!$E$5:$E$59=B$7)*(COUNTIF(A$8:A22,'Výpočet kapacit'!$F$5:$F$59)=0),0)),\"\")","v":""},{"$f":"SUMIFS('Výpočet kapacit'!$G$5:$G$59,'Výpočet kapacit'!$F$5:$F$59,A23,'Výpočet kapacit'!$E$5:$E$59,B$7)/1000","v":0},null,{"$f":"IFERROR(INDEX('Výpočet kapacit'!$F$5:$F$59,MATCH(1,('Výpočet kapacit'!$E$5:$E$59=E$7)*(COUNTIF(D$8:D22,'Výpočet kapacit'!$F$5:$F$59)=0),0)),\"\")","v":""},{"$f":"SUMIFS('Výpočet kapacit'!$G$5:$G$59,'Výpočet kapacit'!$F$5:$F$59,D23,'Výpočet kapacit'!$E$5:$E$59,E$7)/1000","v":0},null,{"$f":"IFERROR(INDEX('Výpočet kapacit'!$F$5:$F$59,MATCH(1,('Výpočet kapacit'!$E$5:$E$59=H$7)*(COUNTIF(G$8:G22,'Výpočet kapacit'!$F$5:$F$59)=0),0)),\"\")","v":""},{"$f":"SUMIFS('Výpočet kapacit'!$G$5:$G$59,'Výpočet kapacit'!$F$5:$F$59,G23,'Výpočet kapacit'!$E$5:$E$59,H$7)/1000","v":0},null,{"$f":"IFERROR(INDEX('Výpočet kapacit'!$F$5:$F$59,MATCH(1,('Výpočet kapacit'!$E$5:$E$59=K$7)*(COUNTIF(J$8:J22,'Výpočet kapacit'!$F$5:$F$59)=0),0)),\"\")","v":""},{"$f":"SUMIFS('Výpočet kapacit'!$G$5:$G$59,'Výpočet kapacit'!$F$5:$F$59,J23,'Výpočet kapacit'!$E$5:$E$59,K$7)/1000","v":0},null,{"$f":"IFERROR(INDEX('Výpočet kapacit'!$F$5:$F$59,MATCH(1,('Výpočet kapacit'!$E$5:$E$59=N$7)*(COUNTIF(M$8:M22,'Výpočet kapacit'!$F$5:$F$59)=0),0)),\"\")","v":""},{"$f":"SUMIFS('Výpočet kapacit'!$G$5:$G$59,'Výpočet kapacit'!$F$5:$F$59,M23,'Výpočet kapacit'!$E$5:$E$59,N$7)/1000","v":0},null,{"$f":"IFERROR(INDEX('Výpočet kapacit'!$F$5:$F$59,MATCH(1,('Výpočet kapacit'!$E$5:$E$59=Q$7)*(COUNTIF(P$8:P22,'Výpočet kapacit'!$F$5:$F$59)=0),0)),\"\")","v":""},{"$f":"SUMIFS('Výpočet kapacit'!$G$5:$G$59,'Výpočet kapacit'!$F$5:$F$59,P23,'Výpočet kapacit'!$E$5:$E$59,Q$7)/1000","v":0},null,{"$f":"IFERROR(INDEX('Výpočet kapacit'!$F$5:$F$59,MATCH(1,('Výpočet kapacit'!$E$5:$E$59=T$7)*(COUNTIF(S$8:S22,'Výpočet kapacit'!$F$5:$F$59)=0),0)),\"\")","v":""},{"$f":"SUMIFS('Výpočet kapacit'!$G$5:$G$59,'Výpočet kapacit'!$F$5:$F$59,S23,'Výpočet kapacit'!$E$5:$E$59,T$7)/1000","v":0},null,{"$f":"IFERROR(INDEX('Výpočet kapacit'!$F$5:$F$59,MATCH(1,('Výpočet kapacit'!$E$5:$E$59=W$7)*(COUNTIF(V$8:V22,'Výpočet kapacit'!$F$5:$F$59)=0),0)),\"\")","v":""},{"$f":"SUMIFS('Výpočet kapacit'!$G$5:$G$59,'Výpočet kapacit'!$F$5:$F$59,V23,'Výpočet kapacit'!$E$5:$E$59,W$7)/1000","v":0}]
[{"$f":"IFERROR(INDEX('Výpočet kapacit'!$F$5:$F$59,MATCH(1,('Výpočet kapacit'!$E$5:$E$59=B$7)*(COUNTIF(A$8:A23,'Výpočet kapacit'!$F$5:$F$59)=0),0)),\"\")","v":""},{"$f":"SUMIFS('Výpočet kapacit'!$G$5:$G$59,'Výpočet kapacit'!$F$5:$F$59,A24,'Výpočet kapacit'!$E$5:$E$59,B$7)/1000","v":0},null,{"$f":"IFERROR(INDEX('Výpočet kapacit'!$F$5:$F$59,MATCH(1,('Výpočet kapacit'!$E$5:$E$59=E$7)*(COUNTIF(D$8:D23,'Výpočet kapacit'!$F$5:$F$59)=0),0)),\"\")","v":""},{"$f":"SUMIFS('Výpočet kapacit'!$G$5:$G$59,'Výpočet kapacit'!$F$5:$F$59,D24,'Výpočet kapacit'!$E$5:$E$59,E$7)/1000","v":0},null,{"$f":"IFERROR(INDEX('Výpočet kapacit'!$F$5:$F$59,MATCH(1,('Výpočet kapacit'!$E$5:$E$59=H$7)*(COUNTIF(G$8:G23,'Výpočet kapacit'!$F$5:$F$59)=0),0)),\"\")","v":""},{"$f":"SUMIFS('Výpočet kapacit'!$G$5:$G$59,'Výpočet kapacit'!$F$5:$F$59,G24,'Výpočet kapacit'!$E$5:$E$59,H$7)/1000","v":0},null,{"$f":"IFERROR(INDEX('Výpočet kapacit'!$F$5:$F$59,MATCH(1,('Výpočet kapacit'!$E$5:$E$59=K$7)*(COUNTIF(J$8:J23,'Výpočet kapacit'!$F$5:$F$59)=0),0)),\"\")","v":""},{"$f":"SUMIFS('Výpočet kapacit'!$G$5:$G$59,'Výpočet kapacit'!$F$5:$F$59,J24,'Výpočet kapacit'!$E$5:$E$59,K$7)/1000","v":0},null,{"$f":"IFERROR(INDEX('Výpočet kapacit'!$F$5:$F$59,MATCH(1,('Výpočet kapacit'!$E$5:$E$59=N$7)*(COUNTIF(M$8:M23,'Výpočet kapacit'!$F$5:$F$59)=0),0)),\"\")","v":""},{"$f":"SUMIFS('Výpočet kapacit'!$G$5:$G$59,'Výpočet kapacit'!$F$5:$F$59,M24,'Výpočet kapacit'!$E$5:$E$59,N$7)/1000","v":0},null,{"$f":"IFERROR(INDEX('Výpočet kapacit'!$F$5:$F$59,MATCH(1,('Výpočet kapacit'!$E$5:$E$59=Q$7)*(COUNTIF(P$8:P23,'Výpočet kapacit'!$F$5:$F$59)=0),0)),\"\")","v":""},{"$f":"SUMIFS('Výpočet kapacit'!$G$5:$G$59,'Výpočet kapacit'!$F$5:$F$59,P24,'Výpočet kapacit'!$E$5:$E$59,Q$7)/1000","v":0},null,{"$f":"IFERROR(INDEX('Výpočet kapacit'!$F$5:$F$59,MATCH(1,('Výpočet kapacit'!$E$5:$E$59=T$7)*(COUNTIF(S$8:S23,'Výpočet kapacit'!$F$5:$F$59)=0),0)),\"\")","v":""},{"$f":"SUMIFS('Výpočet kapacit'!$G$5:$G$59,'Výpočet kapacit'!$F$5:$F$59,S24,'Výpočet kapacit'!$E$5:$E$59,T$7)/1000","v":0},null,{"$f":"IFERROR(INDEX('Výpočet kapacit'!$F$5:$F$59,MATCH(1,('Výpočet kapacit'!$E$5:$E$59=W$7)*(COUNTIF(V$8:V23,'Výpočet kapacit'!$F$5:$F$59)=0),0)),\"\")","v":""},{"$f":"SUMIFS('Výpočet kapacit'!$G$5:$G$59,'Výpočet kapacit'!$F$5:$F$59,V24,'Výpočet kapacit'!$E$5:$E$59,W$7)/1000","v":0}]

{"sheet":"Seznam dílů","index":2,"n_rows":101,"n_cols":6,"rows_kept":101,"cut":false,"hidden":false,"merged":[]}
["Číslo dílu","Název dílu","Normový čas (s)","Jakost materiálu","Průměr/Rozměr","Délka kusu"]
["PPB-001.04.02","vložka",62,4301,16,25]
["PPB-001.06.04","čep 1 D8",22,4301,8,15]
["PPB-001.08.04","čep 2 D8",23,4301,8,21]
["PPB-001.10.02 a","osa ramene infuzáku",42,4301,16,94]
["PPB-001.10.03 b","dorazový čep 1",63,4301,10,52]
["PPB-001.10.04 b","dorazový čep 2",25,4301,10,22]
["PPB-001.10.05","trubka",170,11373,"45x5",100]
["PPB-001.10.06","knoflík",296,11373,55,27]
["PPB-001.16.01 a","šestihran 2",30,4301,"SW11",68]
["PPB-002.28","seřizovací šroub dlouhý",57,"EN2007",22,14]
["PPB-002.30 a","čep motoru",31,4301,8,43]
["PPB-003.09.02","čep misky",143,4301,15,83]
["PPB-005.02.01.04","čep výztuhy zadního madla",18,4301,10,28]
["PPB-005.06 a","odjišťovací čep",107,"PA",30,39]
["PPB-005.18","čep hladký s drážkami",37,4305,10,64]
["PPB-005.19 a","čep hladký",56,4305,10,88]
["PPB-005.22","doraz CPR",58,4301,25,12]
["PPB-006.01.01 a","nosná trubka 1",125,11373,"51x3,2",152]
["PPB-006.01.02 a","nosná trubka 2",125,11373,"51x3,2",115]
["PPB-006.01.04 b","vložka trubky",126,11373,50,30]
["PPB-006.02.02 a","čep táhla",42,4301,15,43]
["PPB-006.02.04","vodící čep",22,4301,10,24]
["PPB-006.03.04 a","rozpěrná trubka 1",35,11373,"22x3",164]
["PPB-006.03.05 a","rozpěrná trubka 2",34,11373,"22x3",124]
["PPB-006.05.06 a","čep s drážkou",38,4301,15,14]
["PPB-006.08.02 a","čep ovládače",53,4301,12,34]
["PPB-006.09.01 b","váleček táhla",75,4301,20,25]
["PPB-006.10.01 a","čepka ovladače",107,4301,30,20]
["PPB-006.14.01 a","čep zajišťovače",42,4301,12,130]
["PPB-006.14.02 b","zajišťovací čep",75,4301,18,18]
["PPB-006.19","dorazový váleček",40,4305,12,20]
["PPB-006.25 a","čep hladký s drážkou",35,4305,15,144]
["PPB-006.26.01 a","čep hladký",29,4301,15,99]
["PPB-006.28 a","čep hladký",33,4305,15,192]
["PPB-006.29","čep hladký s drážkami",27,4305,10,40]
["PPB-006.30","čep hladký s drážkami",37,4305,10,36]
["PPB-006.31.01","čep hladký",18,4301,10,26]
["PPB-007.07.07 b","přitlačná tyč",89,4305,16,64]
["PPB-007.07.14 a","čep 6x35",31,4305,6,35]
["PPB-007.07.15 a","čep 4x41,6",32,4305,4,42]
["PPB-007.07.16","čep 4x54",21,4305,4,54]
["PPB-007.07.17","čep 4x38",17,4305,4,38]
["PPB-007.08.02","pouzdro vidící",39,11373,"22x3",25]
["PPB-007.08.06","čep vedení",49,4301,8,18]
["PPB-007.08.09","čep deaktivace",30,4301,8,7]
["PPB-007.11","čep aretace nohy",24,4301,10,26]
["PPB-007.14.01","čep páčky",61,4301,15,49]
["PPB-007.15.01 a","pouzdro páčky",31,11373,14,10]
["PPB-007.23.01","rozpěrka napínání",40,"EN2007",10,25]
["PPB-007.25 b","vložka pružiny",62,"PA6",30,57]
["PPB-007.26.01","pouzdro vedení",54,11373,"20x2",70]
["PPB-007.33 a","šroub zajištění",34,4301,6,30]
["PPB-010.07 b","čep palce",108,4301,22,15]
["PPB-010.08.02","čep táhla",20,4301,8,13]
["PPB-015 a","nosný čep",54,4305,20,219]
["PPB-016.01 a","trubička",87,11523,24,23]
["PPB-017.02 a","čep táhla",49,4301,15,54]
["PPB-018 a","čep nohy",42,4305,20,53]
["PPB-019","čep hlavní",30,4305,15,61]
["PPB-020","čep hladký s drážkami",36,4305,10,49]
["PPB-021","čep hladký s drážkami",38,4305,10,61]
["PPB-029","čep hladký s drážkami",46,4305,12,49]
["PPB-012.02.03.07.02","čep zajišťovače",20,4301,8,24]
["PPB-012.02.02.03","čep ramena rajcáku",74,4301,22,47]
["PPB-012.02.03.06.02","trn zajišťovače",31,4301,8,111]
["PPB-012.02.03.06.01","kryt trnu zajišťovače",75,"PA6",20,25]
["PPB-012.02.02.02","náboj ramene rajcaku",49,11373,"30x4",42]
["PPB-60.05 b","trn čela",74,4301,16,110]
["PPB-064.01.02","váleček",39,4301,14,19]
["PPB-067.02.01.03","váleček držáku",36,4301,14,12]
["PPB-067.02.01.02 a","válec držáku hrazdy L",200,4301,35,70]
["PPB-067.03.01.02 a","válec držáku hrazdy P",200,4301,35,70]
["PPB-067.01.01.02 a","čep hrazdy levý",185,4301,32,115]
["PPB-067.01.01.03 a","čep hrazdy pravý",185,4301,32,115]
["PPB-069.01.02","čep madla pd",90,4301,22,45]
["DIA-020.08 a","čep krátký",39,4301,10,49]
["DIA-ZP-003.01.03 b","vložka držáku",112,11373,35,25]
["DIA-ZP-003.01.04 a","trubka",70,11373,"45x5",110]
["PPA-06.19.05","čep",29,4301,15,20]
["PPA-24","zemnící vložka",25,4301,10,5]
["PPA-06.14 c","čep 4",80,4301,20,26]
["PPA-102.07","seřizovací šroub",57,"EN2007",22,11]
["PPA-077.15 d","kluzná podložka",75,"CuAl10Fe3Mn1,5",32,10]
["PPA-077.01.03 b","čep d26",130,4301,26,115]
["SLA-001.36 a","krytka kola",35,"Ertalon Černý",32,7]
["SLA-033 a","čep",38,4301,10,33]
["SLA-018 a","čep 10x30",16,4301,10,30]
["SLA-013","čep",17,4301,10,35]
["SLA-001.30.02 b","šestihran pedálu P",21,4301,"SW11",69]
["SLA-001.31.02 b","šestihran pedálu L",21,4301,"SW11",69]
["SLA-007.04.03 c","náboj područky",159,11373,45,52]
["SLA-001.09 g","hřídel nápravy",78,11373,12,700]
["SLA-001.01.17","úchyt",86,11373,35,6]
["SLA-026","šroub područky",35,11373,"SW12",20]
["SLA-020.01.02","čep dorazu",40,11373,18,14]
["SLA-001.01.09 e","pouzdro",40,11373,"45x8",72]
["SLA-003.02.05.07","aretace lanka",40,11373,5,10]
["SLA-003.16.02.03","nosný čep páčky",40,4301,8,13]
["SLA-003.19.05.01","rozpěrka 7,4x25",70,"EN2007",10,25]
["SLA-003.19.05.03","matice rýhovaná M6x7",25,"EN2007",10,7]

{"sheet":"Průměry","index":3,"n_rows":36,"n_cols":12,"rows_kept":36,"cut":false,"hidden":false,"merged":[]}
[4301,"Seznam průměrů"]
[4305,4,null,null,null,"Mezivýpočty 2 sloupec","Mezivýpočty 3 sloupec","Mezivýpočty 4 sloupec","Mezivýpočty 5 sloupec","Mezivýpočty 6 sloupec","Mezivýpočty 7 sloupec","Mezivýpočty 8 sloupec"]
[11373,5,null,null,null,{"$f":"IF('Seznam materiálu'!B4=Průměry!A2,0,IFERROR(VLOOKUP(Průměry!A2,'Výpočet kapacit'!E5:E59,1,FALSE),0))","v":4305},{"$f":"IF('Seznam materiálu'!B4=Průměry!A3,0,IF('Seznam materiálu'!E4=Průměry!A3,0,IF('Seznam materiálu'!B4=Průměry!A3,0,IF('Seznam materiálu'!E4=0,0,IFERROR(VLOOKUP(Průměry!A3,'Výpočet kapacit'!E5:E59,1,FALSE),0)))))","v":11373},{"$f":"IF(A4='Seznam materiálu'!B4,0,IF('Seznam materiálu'!H4=Průměry!A4,0,IF(F5='Seznam materiálu'!E4,0,IF('Seznam materiálu'!H4=0,0,IFERROR(VLOOKUP(Průměry!A4,'Výpočet kapacit'!E5:E59,1,FALSE),0)))))","v":0},{"$f":"IF(F6='Seznam materiálu'!E4,0,IF(G5='Seznam materiálu'!H4,0,IF('Seznam materiálu'!K4=Průměry!A5,0,IF('Seznam materiálu'!K4=0,0,IFERROR(VLOOKUP(Průměry!A5,'Výpočet kapacit'!E5:E59,1,FALSE),0)))))","v":0},{"$f":"IF(A6='Seznam materiálu'!B4,0,IF(F7='Seznam materiálu'!E4,0,IF(I4='Seznam materiálu'!N4,0,IF(H5='Seznam materiálu'!K4,0,IF(G6='Seznam materiálu'!H4,0,IF('Seznam materiálu'!N4=Průměry!A6,0,IFERROR(VLOOKUP(Průměry!A6,'Výpočet kapacit'!E5:E59,1,FALSE),0)))))))","v":0},{"$f":"IF(A7='Seznam materiálu'!B4,0,IF(J4='Seznam materiálu'!Q4,0,IF(I5='Seznam materiálu'!N4=0,0,IF(H6='Seznam materiálu'!K4,0,IF(G7='Seznam materiálu'!H4,0,IF(F8='Seznam materiálu'!E4,0,IF('Seznam materiálu'!Q4=0,0,IFERROR(VLOOKUP(Průměry!A$7,'Výpočet kapacit'!E$5:E$59,1,FALSE),0))))))))","v":0},{"$f":"IF(A8='Seznam materiálu'!B4,0,IF(K4='Seznam materiálu'!T4,0,IF(J5='Seznam materiálu'!Q4,0,IF(I6='Seznam materiálu'!N4,0,IF(H7='Seznam materiálu'!K4,0,IF(G8='Seznam materiálu'!H4,0,IF(F9='Seznam materiálu'!E4,0,IF('Seznam materiálu'!T4=0,0,IFERROR(VLOOKUP(Průměry!A8,'Výpočet kapacit'!E5:E59,1,FALSE),0)))))))))","v":0}]
[11523,6,null,null,null,{"$f":"IF('Seznam materiálu'!B4=Průměry!A3,0,IFERROR(VLOOKUP(A3,'Výpočet kapacit'!E5:E59,1,FALSE),0))","v":11373},{"$f":"IF('Seznam materiálu'!B4=Průměry!A4,0,IF('Seznam materiálu'!E4=Průměry!F5,0,IFERROR(VLOOKUP(A4,'Výpočet kapacit'!E5:E59,1,FALSE),0)))","v":0},{"$f":"IF(A5='Seznam materiálu'!B4,0,IF(F6='Seznam materiálu'!E$4,0,IF('Seznam materiálu'!H$4=Průměry!G5,0,IFERROR(VLOOKUP(A5,'Výpočet kapacit'!E$5:E$59,1,FALSE),0))))","v":0},{"$f":"IF(A6='Seznam materiálu'!B4,0,IF(H5='Seznam materiálu'!K4,0,IF(Průměry!F7='Seznam materiálu'!B4,0,IF(G6='Seznam materiálu'!H4,0,IF('Seznam materiálu'!K4=Průměry!A6,0,IF('Seznam materiálu'!K4=0,0,IFERROR(VLOOKUP(Průměry!A6,'Výpočet kapacit'!E6:E60,1,FALSE),0)))))))","v":0},{"$f":"IF(A7='Seznam materiálu'!B4,0,IF(I5='Seznam materiálu'!N4,0,IF(H6='Seznam materiálu'!K4,0,IF(G7='Seznam materiálu'!H4,0,IF(F8='Seznam materiálu'!E4,0,IF('Seznam materiálu'!N4=Průměry!A7,0,IFERROR(VLOOKUP(Průměry!A7,'Výpočet kapacit'!E5:E59,1,FALSE),0)))))))","v":0},{"$f":"IF(A8='Seznam materiálu'!B4,0,IF(J5='Seznam materiálu'!Q4,0,IF(I6='Seznam materiálu'!N4,0,IF(H7='Seznam materiálu'!K4,0,IF(G8='Seznam materiálu'!H4,0,IF(F9='Seznam materiálu'!E4,0,IFERROR(VLOOKUP(A8,'Výpočet kapacit'!E5:E59,1,FALSE),0)))))))","v":0}]
["PA6",8,null,null,null,{"$f":"IF('Seznam materiálu'!B4=Průměry!A4,0,IFERROR(VLOOKUP(A4,'Výpočet kapacit'!E5:E59,1,FALSE),0))","v":0},{"$f":"IF('Seznam materiálu'!B4=Průměry!A5,0,IF('Seznam materiálu'!E4=Průměry!F6,0,IFERROR(VLOOKUP(A5,'Výpočet kapacit'!E5:E59,1,FALSE),0)))","v":0},{"$f":"IF(A6='Seznam materiálu'!B4,0,IF(F7='Seznam materiálu'!E$4,0,IF('Seznam materiálu'!H$4=Průměry!G6,0,IFERROR(VLOOKUP(A6,'Výpočet kapacit'!E$5:E$59,1,FALSE),0))))","v":0},{"$f":"IF(A7='Seznam materiálu'!B4,0,IF(F8='Seznam materiálu'!B4,0,IF(G7='Seznam materiálu'!K4,0,IF(H6='Seznam materiálu'!K4,0,IF('Seznam materiálu'!K4=Průměry!A7,0,IF('Seznam materiálu'!K4=0,0,IFERROR(VLOOKUP(Průměry!A7,'Výpočet kapacit'!E5:E59,1,FALSE),0)))))))","v":0},{"$f":"IF(A8='Seznam materiálu'!B4,0,IF(I6='Seznam materiálu'!N4,0,IF(H7='Seznam materiálu'!K4,0,IF(G8='Seznam materiálu'!H4,0,IF(F9='Seznam materiálu'!E4,0,IF('Seznam materiálu'!N4=Průměry!A8,0,IFERROR(VLOOKUP(Průměry!A8,'Výpočet kapacit'!E5:E59,1,FALSE),0)))))))","v":0},{"$f":"IF(A9='Seznam materiálu'!B4,0,IF(J6='Seznam materiálu'!Q4,0,IF(I7='Seznam materiálu'!N4,0,IF(H8='Seznam materiálu'!K4,0,IF(G9='Seznam materiálu'!H4,0,IF(F10='Seznam materiálu'!E4,0,IFERROR(VLOOKUP(A9,'Výpočet kapacit'!E5:E59,1,FALSE),0)))))))","v":0}]
["Ertalon černý",10,null,null,null,{"$f":"IF('Seznam materiálu'!B4=Průměry!A5,0,IFERROR(VLOOKUP(A5,'Výpočet kapacit'!E5:E59,1,FALSE),0))","v":0},{"$f":"IF('Seznam materiálu'!B4=Průměry!A6,0,IF('Seznam materiálu'!E4=Průměry!F7,0,IFERROR(VLOOKUP(A6,'Výpočet kapacit'!E5:E59,1,FALSE),0)))","v":0},{"$f":"IF(A7='Seznam materiálu'!B4,0,IF(F8='Seznam materiálu'!E$4,0,IF('Seznam materiálu'!H$4=Průměry!G7,0,IFERROR(VLOOKUP(A7,'Výpočet kapacit'!E$5:E$59,1,FALSE),0))))","v":0},{"$f":"IF(A8='Seznam materiálu'!B4,0,IF('Seznam materiálu'!K4=Průměry!A8,0,IF('Seznam materiálu'!K4=0,0,IFERROR(VLOOKUP(Průměry!A8,'Výpočet kapacit'!E5:E49,1,FALSE),0))))","v":0},{"$f":"IF(A9='Seznam materiálu'!B4,0,IF(I7='Seznam materiálu'!N4,0,IF(H8='Seznam materiálu'!K4,0,IF(G9='Seznam materiálu'!H4,0,IF(F10='Seznam materiálu'!E4,0,IF('Seznam materiálu'!N4=Průměry!A9,0,IFERROR(VLOOKUP(Průměry!A9,'Výpočet kapacit'!E5:E59,1,FALSE),0)))))))","v":0}]
["EN2007",12,null,null,null,{"$f":"IF('Seznam materiálu'!B4=Průměry!A6,0,IFERROR(VLOOKUP(A6,'Výpočet kapacit'!E5:E59,1,FALSE),0))","v":0},{"$f":"IF('Seznam materiálu'!B4=Průměry!A7,0,IF('Seznam materiálu'!E4=Průměry!F8,0,IFERROR(VLOOKUP(A7,'Výpočet kapacit'!E5:E59,1,FALSE),0)))","v":0},{"$f":"IF(A8='Seznam materiálu'!B4,0,IF(F9='Seznam materiálu'!E$4,0,IF('Seznam materiálu'!H$4=Průměry!G8,0,IFERROR(VLOOKUP(A8,'Výpočet kapacit'!E$5:E$59,1,FALSE),0))))","v":0},{"$f":"IF(A9='Seznam materiálu'!B4,0,IF('Seznam materiálu'!K4=Průměry!A9,0,IF('Seznam materiálu'!K4=0,0,IFERROR(VLOOKUP(Průměry!A9,'Výpočet kapacit'!E5:E59,1,FALSE),0))))","v":0}]
["CuAl10Fe3Mn1,5",14,null,null,null,{"$f":"IF('Seznam materiálu'!B4=Průměry!A7,0,IFERROR(VLOOKUP(A7,'Výpočet kapacit'!E5:E59,1,FALSE),0))","v":0},{"$f":"IF('Seznam materiálu'!B4=Průměry!A8,0,IF('Seznam materiálu'!E4=Průměry!F9,0,IFERROR(VLOOKUP(A8,'Výpočet kapacit'!E5:E59,1,FALSE),0)))","v":0},{"$f":"IF(A9='Seznam materiálu'!B4,0,IF(F10='Seznam materiálu'!E$4,0,IF('Seznam materiálu'!H$4=Průměry!G9,0,IFERROR(VLOOKUP(A9,'Výpočet kapacit'!E$5:E$59,1,FALSE),0))))","v":0}]
["PA",15,null,null,null,{"$f":"IF('Seznam materiálu'!B4=Průměry!A8,0,IFERROR(VLOOKUP(A8,'Výpočet kapacit'!E5:E59,1,FALSE),0))","v":0},{"$f":"IF('Seznam materiálu'!B4=Průměry!A9,0,IF('Seznam materiálu'!E4=Průměry!F10,0,IFERROR(VLOOKUP(A9,'Výpočet kapacit'!E5:E59,1,FALSE),0)))","v":0}]
[null,16,null,null,null,{"$f":"IF('Seznam materiálu'!B4=Průměry!A9,0,IFERROR(VLOOKUP(A9,'Výpočet kapacit'!E5:E59,1,FALSE),0))","v":0}]
[null,18]
[null,20]
[null,22]
[null,24]
[null,25]
[null,26]
[null,28]
[null,30]
[null,32]
[null,35]
[null,38]
[null,40]
[null,42]
[null,45]
[null,48]
[null,50]
[null,55]
[null,"20x2"]
[null,"22x2"]
[null,"22x3"]
[null,"30x4"]
[null,"45x5"]
[null,"45x8"]
[null,"51x3,2"]
[null,"SW11"]
[null,"SW12"]

{"sheet":"List1","index":4,"n_rows":94,"n_cols":8,"rows_kept":94,"cut":false,"hidden":false,"merged":[]}
["DIA-020.08 a","DIA-020.08 a",39,9.1999999999999993,120,{"$f":"(2400*0.14)/E1","v":2.8000000000000003},{"$f":"C1*0.18","v":7.02},{"$f":"D1-F1-G1","v":-0.62000000000000099}]
["DIA-ZP-003.01.03 b","DIA-ZP-003.01.03 b",112,24.1,40,{"$f":"(2400*0.14)/E2","v":8.4000000000000021},{"$f":"C2*0.18","v":20.16},{"$f":"D2-F2-G2","v":-4.4600000000000009}]
["DIA-ZP-003.01.04 a","DIA-ZP-003.01.04 a",70,53,40,8.4000000000000021,12.6,31.999999999999993]
["PPA-06.14 c","PPA-06.14 c",80,19.100000000000001,40,8.4000000000000021,14.399999999999999,-3.6999999999999993]
["PPA-06.19.05","PPA-06.19.05",29,8.6999999999999993,40,8.4000000000000021,5.22,-4.9200000000000026]
["PPA-077.01.03 b","PPA-077.01.03 b",130,100,80,4.2000000000000011,23.4,72.400000000000006]
["PPA-077.15 d","PPA-077.15 d",75,27.6,120,2.8000000000000003,13.5,11.3]
["PPA-102.07","PPA-102.07",57,14.4,"500",0.67200000000000015,10.26,3.468]
["PPA-24","PPA-24",25,7.3,60,5.6000000000000005,4.5,-2.8000000000000007]
["PPB-001.04.02","PPB-001.04.02",62,10.199999999999999,120,2.8000000000000003,11.16,-3.7600000000000016]
["PPB-001.06.04","PPB-001.06.04",22,5.0999999999999996,120,2.8000000000000003,3.96,-1.6600000000000006]
["PPB-001.08.04","PPB-001.08.04",23,5.9,60,5.6000000000000005,4.1399999999999997,-3.84]
["PPB-001.10.02 a","PPB-001.10.02 a",42,"21,6\n",120,{"$f":"(2400*0.14)/E13","v":2.8000000000000003},7.56,11.24]
["PPB-001.10.03 b","PPB-001.10.03 b",63,"14,9\n",120,2.8000000000000003,11.34,0.76]
["PPB-001.10.04 b","PPB-001.10.04 b",25,"6\n",120,2.8000000000000003,4.5,-1.3]
["PPB-001.10.05","PPB-001.10.05",170,70,60,5.6000000000000005,30.599999999999998,33.800000000000011]
["PPB-001.10.06","PPB-001.10.06",296,76.2,60,5.6000000000000005,53.28,17.320000000000007]
["PPB-001.16.01 a","PPB-001.16.01 a",30,29.2,180,1.8666666666666669,5.3999999999999995,21.933333333333334]
["PPB-002.28","PPB-002.28",57,14.4,800,0.4200000000000001,10.26,3.7200000000000006]
["PPB-002.30 a","PPB-002.30 a",31,7.2,240,1.4000000000000001,5.58,0.21999999999999975]
["PPB-003.09.02","PPB-003.09.02",143,33.299999999999997,60,5.6000000000000005,25.74,1.9599999999999973]
["PPB-005.02.01.04","PPB-005.02.01.04",18,5.5,120,2.8000000000000003,3.2399999999999998,-0.54]
["PPB-005.06 a","PPB-005.06 a",107,11.6,120,2.8000000000000003,19.259999999999998,-10.459999999999999]
["PPB-005.18","PPB-005.18",37,12.1,240,1.4000000000000001,6.66,4.0399999999999991]
["PPB-005.19 a","PPB-005.19 a",56,15.4,60,5.6000000000000005,10.08,-0.27999999999999936]
["PPB-005.22","PPB-005.22",58,23.4,120,2.8000000000000003,10.44,10.159999999999998]
["PPB-006.02.02 a","PPB-006.02.02 a",42,16,60,5.6000000000000005,7.56,2.839999999999999]
["PPB-006.02.04","PPB-006.02.04",22,6,120,2.8000000000000003,3.96,-0.76000000000000023]
["PPB-006.03.04 a","PPB-006.03.04 a",35,33,60,5.6000000000000005,6.3,21.099999999999998]
["PPB-006.03.05 a","PPB-006.03.05 a",34,29,60,5.6000000000000005,6.12,17.279999999999998]
["PPB-006.08.02 a","PPB-006.08.02 a",53,14.5,180,1.8666666666666669,9.5399999999999991,3.0933333333333337]
["PPB-006.09.01 b","PPB-006.09.01 b",75,28.6,"180",1.8666666666666669,13.5,13.233333333333334]
["PPB-006.10.01 a","PPB-006.10.01 a",107,38.799999999999997,90,3.7333333333333338,19.259999999999998,15.806666666666665]
["PPB-006.14.01 a","PPB-006.14.01 a",42,17.5,60,5.6000000000000005,7.56,4.339999999999999]
["PPB-006.14.02 b","PPB-006.14.02 b",75,25.4,60,5.6000000000000005,13.5,6.2999999999999972]
["PPB-006.19","PPB-006.19",40,8.1999999999999993,60,5.6000000000000005,7.1999999999999993,-4.6000000000000005]
["PPB-006.25 a","PPB-006.25 a",35,24.3,60,5.6000000000000005,6.3,12.399999999999999]
["PPB-006.26.01 a","PPB-006.26.01 a",29,17.899999999999999,60,5.6000000000000005,5.22,7.0799999999999974]
["PPB-006.28 a","PPB-006.28 a",33,31.5,60,5.6000000000000005,5.9399999999999995,19.96]
["PPB-006.29","PPB-006.29",27,7.5,120,2.8000000000000003,4.8599999999999994,-0.16000000000000014]
["PPB-006.30","PPB-006.30",37,10.6,60,5.6000000000000005,6.66,-1.660000000000001]
["PPB-006.31.01","PPB-006.31.01",18,5.6,60,5.6000000000000005,3.2399999999999998,-3.2400000000000007]
["PPB-007.07.07 a","PPB-007.07.07 b",89,28.9,120,2.8000000000000003,16.02,10.079999999999998]
["PPB-007.07.14 a","PPB-007.07.14 a",31,7.1,400,0.84000000000000019,5.58,0.67999999999999972]
["PPB-007.07.15 a","PPB-007.07.15 a",32,6.7,200,1.6800000000000004,5.76,-0.74000000000000021]
["PPB-007.07.16","PPB-007.07.16",21,4.7,200,1.6800000000000004,3.78,-0.76000000000000023]
["PPB-007.07.17","PPB-007.07.17",17,4.2,200,1.6800000000000004,3.06,-0.54000000000000048]
["PPB-007.08.02","PPB-007.08.02",39,11.2,120,2.8000000000000003,7.02,1.379999999999999]
["PPB-007.08.06","PPB-007.08.06",49,10.7,120,2.8000000000000003,8.82,-0.92000000000000171]
["PPB-007.08.09","PPB-007.08.09",30,7.2,120,2.8000000000000003,5.3999999999999995,-0.99999999999999911]
["PPB-007.11","PPB-007.11",24,8.1,120,2.8000000000000003,4.32,0.97999999999999865]
["PPB-007.14.01","PPB-007.14.01",61,17.100000000000001,120,2.8000000000000003,10.98,3.3200000000000003]
["PPB-007.15.01 a","PPB-007.15.01 a",31,8.6,120,2.8000000000000003,5.58,0.21999999999999886]
["PPB-007.25 b","PPB-007.25 b",62,30,200,1.6800000000000004,11.16,17.16]
["PPB-007.26.01","PPB-007.26.01",54,35.4,120,2.8000000000000003,9.7199999999999989,22.880000000000003]
["PPB-007.33 a","PPB-007.33 a",34,"16,2\n",120,2.8000000000000003,6.12,7.28]
["PPB-010.07 b","PPB-010.07 b",108,8.1,120,2.8000000000000003,19.439999999999998,-14.139999999999999]
["PPB-010.08.02","PPB-010.08.02",20,4.2,120,2.8000000000000003,3.5999999999999996,-2.1999999999999997]
["PPB-012.02.02.02","PPB-012.02.02.02",49,24.2,120,2.8000000000000003,8.82,12.579999999999998]
["PPB-012.02.02.03","PPB-012.02.02.03",74,28.9,120,2.8000000000000003,13.32,12.779999999999998]
["PPB-012.02.03.06.01","PPB-012.02.03.06.01",75,25.4,60,5.6000000000000005,13.5,6.2999999999999972]
["PPB-012.02.03.06.02","PPB-012.02.03.06.02",31,25.4,60,5.6000000000000005,5.58,14.219999999999997]
["PPB-012.02.03.07.02","PPB-012.02.03.07.02",20,8,60,5.6000000000000005,3.5999999999999996,-1.2000000000000002]
["PPB-015 a","PPB-015 a",54,69.599999999999994,60,5.6000000000000005,9.7199999999999989,54.279999999999994]
["PPB-017.02 a","PPB-017.02 a",49,12.5,60,5.6000000000000005,8.82,-1.9200000000000008]
["PPB-018","PPB-018 a",42,25.6,120,{"$f":"(2400*0.14)/E66","v":2.8000000000000003},{"$f":"C66*0.18","v":7.56},{"$f":"D66-F66-G66","v":15.240000000000002}]
["PPB-019","PPB-019",30,12.9,120,2.8000000000000003,5.3999999999999995,4.7]
["PPB-020","PPB-020",36,11.5,120,2.8000000000000003,6.4799999999999995,2.2199999999999998]
["PPB-021","PPB-021",38,12.2,120,2.8000000000000003,6.84,2.5599999999999987]
["PPB-029","PPB-029",46,13.4,60,5.6000000000000005,8.2799999999999994,-0.47999999999999954]
["PPB-060.05 b",null,null,34,60,5.6000000000000005,0,28.4]
["PPB-064.01.02","PPB-064.01.02",39,12.6,240,1.4000000000000001,7.02,4.18]
["PPB-067.01.01.02 a","PPB-067.01.01.02 a",185,12.6,60,5.6000000000000005,33.299999999999997,-26.299999999999997]
["PPB-067.01.01.03 a","PPB-067.01.01.03 a",185,"105,2\n",60,5.6000000000000005,33.299999999999997,66.599999999999994]
["PPB-067.02.01.02 a","PPB-067.02.01.02 a",200,"88,2\n",60,5.6000000000000005,36,46.4]
["PPB-067.02.01.03","PPB-067.02.01.03",36,12.9,60,5.6000000000000005,6.4799999999999995,0.82000000000000028]
["PPB-067.03.01.02 a","PPB-067.03.01.02 a",200,86.1,60,5.6000000000000005,36,44.5]
["PPB-069.01.02","PPB-069.01.02",90,32.1,120,2.8000000000000003,16.2,13.100000000000001]
["SLA-001.01.09 e","SLA-001.01.09 e",40,66,120,2.8000000000000003,7.1999999999999993,56]
["SLA-001.01.17","SLA-001.01.17",86,22.9,120,2.8000000000000003,15.479999999999999,4.6199999999999992]
["SLA-001.09 g","SLA-001.09 g",78,35,60,5.6000000000000005,14.04,15.36]
["SLA-001.30.02 b","SLA-001.30.02 b",21,26.9,60,5.6000000000000005,3.78,17.519999999999996]
["SLA-001.31.02 b","SLA-001.31.02 b",21,26.9,60,5.6000000000000005,3.78,17.519999999999996]
["SLA-001.36 a","SLA-001.36 a",35,13.2,120,2.8000000000000003,6.3,4.0999999999999988]
["SLA-003.02.05.07","SLA-003.02.05.07",40,13.1,100,3.3600000000000008,7.1999999999999993,2.5399999999999991]
["SLA-003.16.02.03","SLA-003.16.02.03",40,9.6,60,5.6000000000000005,7.1999999999999993,-3.2]
["SLA-003.19.05.01","SLA-003.19.05.01",70,11.7,100,3.3600000000000008,12.6,-4.2600000000000016]
["SLA-003.19.05.03","SLA-003.19.05.03",25,5.57,100,3.3600000000000008,4.5,-2.2900000000000005]
["SLA-007.04.03 c","SLA-007.04.03 c",159,53.6,120,2.8000000000000003,28.619999999999997,22.180000000000007]
["SLA-013","SLA-013",17,4.5,200,1.6800000000000004,3.06,-0.24000000000000066]
["SLA-018 a","SLA-018 a",16,4.0999999999999996,300,1.1200000000000001,2.88,9.9999999999999645E-2]
["SLA-020.01.02","SLA-020.01.02",40,12.5,120,2.8000000000000003,7.1999999999999993,2.5]
["SLA-026","SLA-026",35,14.4,240,1.4000000000000001,6.3,6.7]
["SLA-033 a","SLA-033 a",38,10.199999999999999,60,5.6000000000000005,6.84,-2.2400000000000011]