{"text_format":"1","workbook":"xlsx","n_sheets":5,"sheets":["Výpočet kapacit","Seznam materiálu","Seznam dílů","Průměry","List1"],"not_rendered":{"charts":0,"images":0,"macros":1,"external_links":0,"defined_names":0,"comments":0,"pivot_tables":0},"unopened":[],"bounds":{"document_bytes":16777216,"sheet_cells":100000,"rows_first":2000,"rows_last":500,"rows_between":2000,"halvings":0,"cell_chars":16384,"cell_head_chars":4096},"cells_cut":0,"cells_raw":0,"read":"whole","date_system":"1900"}

{"sheet":"Výpočet kapacit","index":0,"n_rows":63,"n_cols":9,"rows_kept":63,"cut":false,"hidden":false,"merged":[[2,4,2,6],[2,0,2,1]]}
[null,null,null,null,null,"heslo pro odemčení:","pcmetal"]
["Výpočet  objemu zakázky",null,{"$f":"TODAY()","v":"2018-03-12"}]
["OBJEDNÁVKA - VÝROBNÍ ČAS [h] =",null,{"$f":"CEILING(D63,1)","v":6},null,"SOUPIS MATERIÁLŮ - KLIKNI"]
["Číslo dílce","Název dílce","Množství v objednávce","Výrobní čas včetně nastavení","Jakost materiálu","Průměr/Rozměr","Potřebná délka"]
["PPB-001.04.02",{"$f":"IF(A5=0,\"\",(VLOOKUP(A5,'Seznam dílů'!$A$2:$B$111,2,FALSE)))","v":"vložka"},1,{"$f":"IF(A5=0,0,(C5*VLOOKUP(A5,'Seznam dílů'!$A$2:$C$111,3,FALSE)+2700))","v":2762},{"$f":"IFERROR(VLOOKUP(A5,'Seznam dílů'!A$2:F$101,4,FALSE),0)","v":4301},{"$f":"IFERROR(VLOOKUP(A5,'Seznam dílů'!A$2:E$101,5,FALSE),0)","v":16},{"$f":"IFERROR(C5*((VLOOKUP(A5,'Seznam dílů'!A$2:F$101,6,FALSE)+7)),0)","v":32}]
["PPB-001.06.04",{"$f":"IF(A6=0,\"\",(VLOOKUP(A6,'Seznam dílů'!$A$2:$B$111,2,FALSE)))","v":"čep 1 D8"},2,{"$f":"IF(A6=0,0,(C6*VLOOKUP(A6,'Seznam dílů'!$A$2:$C$111,3,FALSE)+2700))","v":2744},{"$f":"IFERROR(VLOOKUP(A6,'Seznam dílů'!A$2:F$101,4,FALSE),0)","v":4301},{"$f":"IFERROR(VLOOKUP(A6,'Seznam dílů'!A$2:E$101,5,FALSE),0)","v":8},{"$f":"IFERROR(C6*((VLOOKUP(A6,'Seznam dílů'!A$2:F$101,6,FALSE)+7)),0)","v":44}]
["PPB-005.18",{"$f":"IF(A7=0,\"\",(VLOOKUP(A7,'Seznam dílů'!$A$2:$B$111,2,FALSE)))","v":"čep hladký s drážkami"},3,{"$f":"IF(A7=0,0,(C7*VLOOKUP(A7,'Seznam dílů'!$A$2:$C$111,3,FALSE)+2700))","v":2811},{"$f":"IFERROR(VLOOKUP(A7,'Seznam dílů'!A$2:F$101,4,FALSE),0)","v":4305},{"$f":"IFERROR(VLOOKUP(A7,'Seznam dílů'!A$2:E$101,5,FALSE),0)","v":10},{"$f":"IFERROR(C7*((VLOOKUP(A7,'Seznam dílů'!A$2:F$101,6,FALSE)+7)),0)","v":213}]
["PPB-001.10.04 b",{"$f":"IF(A8=0,\"\",(VLOOKUP(A8,'Seznam dílů'!$A$2:$B$111,2,FALSE)))","v":"dorazový čep 2"},4,{"$f":"IF(A8=0,0,(C8*VLOOKUP(A8,'Seznam dílů'!$A$2:$C$111,3,FALSE)+2700))","v":2800},{"$f":"IFERROR(VLOOKUP(A8,'Seznam dílů'!A$2:F$101,4,FALSE),0)","v":4301},{"$f":"IFERROR(VLOOKUP(A8,'Seznam dílů'!A$2:E$101,5,FALSE),0)","v":10},{"$f":"IFERROR(C8*((VLOOKUP(A8,'Seznam dílů'!A$2:F$101,6,FALSE)+7)),0)","v":116}]
["PPB-019",{"$f":"IF(A9=0,\"\",(VLOOKUP(A9,'Seznam dílů'!$A$2:$B$111,2,FALSE)))","v":"čep hlavní"},5,{"$f":"IF(A9=0,0,(C9*VLOOKUP(A9,'Seznam dílů'!$A$2:$C$111,3,FALSE)+2700))","v":2850},{"$f":"IFERROR(VLOOKUP(A9,'Seznam dílů'!A$2:F$101,4,FALSE),0)","v":4305},{"$f":"IFERROR(VLOOKUP(A9,'Seznam dílů'!A$2:E$101,5,FALSE),0)","v":15},{"$f":"IFERROR(C9*((VLOOKUP(A9,'Seznam dílů'!A$2:F$101,6,FALSE)+7)),0)","v":340}]
["PPB-001.10.05",{"$f":"IF(A10=0,\"\",(VLOOKUP(A10,'Seznam dílů'!$A$2:$B$111,2,FALSE)))","v":"trubka"},6,{"$f":"IF(A10=0,0,(C10*VLOOKUP(A10,'Seznam dílů'!$A$2:$C$111,3,FALSE)+2700))","v":3720},{"$f":"IFERROR(VLOOKUP(A10,'Seznam dílů'!A$2:F$101,4,FALSE),0)","v":11373},{"$f":"IFERROR(VLOOKUP(A10,'Seznam dílů'!A$2:E$101,5,FALSE),0)","v":"45x5"},{"$f":"IFERROR(C10*((VLOOKUP(A10,'Seznam dílů'!A$2:F$101,6,FALSE)+7)),0)","v":642}]
{"$rows_left_out":54}
{"sheet":"Seznam materiálu","index":1,"n_rows":24,"n_cols":23,"rows_kept":24,"cut":false,"hidden":false,"merged":[[2,0,2,1]]}
["Materiál k objednávce číslo:",null,null,null,null,null,"Datum:"]
[]
["ZPĚT NA VÝPOČET KAPACIT - KLIKNI"]
[{"$f":"IFERROR(IF(B4>0,\"Průměr\",0),0)","v":"Průměr"},{"$f":"IF(IFERROR((VLOOKUP(Průměry!A1,'Výpočet kapacit'!E5:E59,1,FALSE)),0)=Průměry!A1,Průměry!A1,IF(IFERROR(VLOOKUP(Průměry!A2,'Výpočet kapacit'!E5:E59,1,FALSE),0)=Průměry!A2,Průměry!A2,IF(IFERROR(VLOOKUP(Průměry!A3,'Výpočet kapacit'!E5:E59,1,FALSE),0)=Průměry!A3,Průměry!A3,IF(IFERROR(VLOOKUP(Průměry!A4,'Výpočet kapacit'!E5:E59,1,FALSE),0)=Průměry!A4,Průměry!A4,IF(IFERROR(VLOOKUP(Průměry!A5,'Výpočet kapacit'!E5:E59,1,FALSE),0)=Průměry!A5,Průměry!A5,IF(IFERROR(VLOOKUP(Průměry!A6,'Výpočet kapacit'!E5:E59,1,FALSE),0)=Průměry!A6,Průměry!A6,IF(IFERROR(VLOOKUP(Průměry!A7,'Výpočet kapacit'!E5:E59,1,FALSE),0)=Průměry!A7,Průměry!A7,IF(IFERROR(VLOOKUP(Průměry!A8,'Výpočet kapacit'!E5:E59,1,FALSE),0)=Průměry!A8,Průměry!A8,IF(IFERROR(VLOOKUP(Průměry!A9,'Výpočet kapacit'!E5:E59,1,FALSE),0)=Průměry!A9,Průměry!A8,0)))))))))","v":4301},null,{"$f":"IFERROR(IF(E4>0,\"Průměr\",0),0)","v":"Průměr"},{"$f":"IF(B4=0,0,IF(Průměry!F3>0,Průměry!F3,IF(Průměry!F4>0,Průměry!F4,IF(Průměry!F5>0,Průměry!F5,IF(Průměry!F6>0,Průměry!F6,IF(Průměry!F7>0,Průměry!F7,IF(Průměry!F8>0,Průměry!F8,IF(Průměry!F9>0,Průměry!F9,IF(Průměry!F10>0,Průměry!F10,0)))))))))","v":4305},null,{"$f":"IFERROR(IF(H4>0,\"Průměr\",0),0)","v":"Průměr"},{"$f":"IF(E4=0,0,IF(Průměry!G3>0,Průměry!G3,IF(Průměry!G4>0,Průměry!G4,IF(Průměry!G5>0,Průměry!G5,IF(Průměry!G6>0,Průměry!G6,IF(Průměry!G7>0,Průměry!G7,IF(Průměry!G8>0,Průměry!G8,IF(Průměry!G9>0,Průměry!G9,0))))))))","v":11373},null,{"$f":"IFERROR(IF(K4>0,\"Průměr\",0),0)","v":0},{"$f":"IF(H4=0,0,IF(Průměry!H3>0,Průměry!H3,IF(Průměry!H4>0,Průměry!H4,IF(Průměry!H5>0,Průměry!H5,IF(Průměry!H6>0,Průměry!H6,IF(Průměry!H7>0,Průměry!H7,IF(Průměry!H8>0,Průměry!H8,0)))))))","v":0},null,{"$f":"IFERROR(IF(N4>0,\"Průměr\",0),0)","v":0},{"$f":"IF(K4=0,0,IF(Průměry!I3>0,Průměry!I3,IF(Průměry!I4>0,Průměry!I4,IF(Průměry!I5>0,Průměry!I5,IF(Průměry!I6>0,Průměry!I6,IF(Průměry!I7>0,Průměry!I7,0))))))","v":0},null,{"$f":"IFERROR(IF(Q4>0,\"Průměr\",0),0)","v":0},{"$f":"IF(N4=0,0,IF(Průměry!J3>0,Průměry!J3,IF(Průměry!J4>0,Průměry!J4,IF(Průměry!J5>0,Průměry!J5,IF(Průměry!J6>0,Průměry!J6,0)))))","v":0},null,{"$f":"IFERROR(IF(T4>0,\"Průměr\",0),0)","v":0},{"$f":"IF(Q4=0,0,IF(Průměry!K3>0,Průměry!K3,IF(Průměry!K4>0,Průměry!K4,IF(Průměry!K5>0,Průměry!K5,0))))","v":0},null,{"$f":"IFERROR(IF(W4>0,\"Průměr\",0),0)","v":0},{"$f":"IF(T4=0,0,Průměry!L3)","v":0}]
[]
[]
[{"$f":"IF(B7>0,\"Jakost\",0)","v":"Jakost"},{"$f":"B4","v":4301},null,{"$f":"IF(E7>0,\"Jakost\",0)","v":"Jakost"},{"$f":"IF(E4=B4,0,E4)","v":4305},null,{"$f":"IF(H7>0,\"Jakost\",0)","v":"Jakost"},{"$f":"IF(H4=E4,0,IF(H4=B4,0,H4))","v":11373},null,{"$f":"IF(K7>0,\"Jakost\",0)","v":0},{"$f":"IF(H7=0,0,IF(K4=E4,0,IF(K4=H4,0,K4)))","v":0},null,{"$f":"IF(N7>0,\"Jakost\",0)","v":0},{"$f":"IF(K7=0,0,IF(N4=H4,0,IF(N4=K4,0,N4)))","v":0},null,{"$f":"IF(Q7>0,\"Jakost\",0)","v":0},{"$f":"IF(N7=0,0,IF(Q4=K4,0,IF(Q4=N4,0,Q4)))","v":0},null,{"$f":"IF(T7>0,\"Jakost\",0)","v":0},{"$f":"IF(Q7=0,0,IF(T4=N4,0,IF(T4=Q4,0,T4)))","v":0},null,{"$f":"IF(W7>0,\"Jakost\",0)","v":0},{"$f":"IF(T7=0,0,IF(W4=Q4,0,IF(W4=T4,0,W4)))","v":0}]
[{"$f":"A4","v":"Průměr"},{"$f":"IF(B4>0,\"Potřebná délka [m]\",0)","v":"Potřebná délka [m]"},null,{"$f":"IF(E7>0,\"Průměr\",0)","v":"Průměr"},{"$f":"IF(E4>0,\"Potřebná délka [m]\",0)","v":"Potřebná délka [m]"},null,{"$f":"IF(H7>0,\"Průměr\",0)","v":"Průměr"},{"$f":"IF(H4>0,\"Potřebná délka [m]\",0)","v":"Potřebná délka [m]"},null,{"$f":"IF(K7>0,\"Průměr\",0)","v":0},{"$f":"IF(K4>0,\"Potřebná délka [m]\",0)","v":0},null,{"$f":"IF(N7>0,\"Průměr\",0)","v":0},{"$f":"IF(N4>0,\"Potřebná délka [m]\",0)","v":0},null,{"$f":"IF(Q7>0,\"Průměr\",0)","v":0},{"$f":"IF(Q4>0,\"Potřebná délka [m]\",0)","v":0},null,{"$f":"IF(T7>0,\"Průměr\",0)","v":0},{"$f":"IF(T4>0,\"Potřebná délka [m]\",0)","v":0},null,{"$f":"IF(W7>0,\"Průměr\",0)","v":0},{"$f":"IF(W4>0,\"Potřebná délka [m]\",0)","v":0}]
[{"$f":"IFERROR(INDEX('Výpočet kapacit'!$F$5:$F$59,MATCH(1,('Výpočet kapacit'!$E$5:$E$59=B$7)*(COUNTIF(A$8:A8,'Výpočet kapacit'!$F$5:$F$59)=0),0)),\"\")","v":16},{"$f":"SUMIFS('Výpočet kapacit'!$G$5:$G$59,'Výpočet kapacit'!$F$5:$F$59,A9,'Výpočet kapacit'!$E$5:$E$59,B$7)/1000","v":3.2000000000000001E-2},null,{"$f":"IFERROR(INDEX('Výpočet kapacit'!$F$5:$F$59,MATCH(1,('Výpočet kapacit'!$E$5:$E$59=E$7)*(COUNTIF(D$8:D8,'Výpočet kapacit'!$F$5:$F$59)=0),0)),\"\")","v":10},{"$f":"SUMIFS('Výpočet kapacit'!$G$5:$G$59,'Výpočet kapacit'!$F$5:$F$59,D9,'Výpočet kapacit'!$E$5:$E$59,E$7)/1000","v":0.21299999999999999},null,{"$f":"IFERROR(INDEX('Výpočet kapacit'!$F$5:$F$59,MATCH(1,('Výpočet kapacit'!$E$5:$E$59=H$7)*(COUNTIF(G$8:G8,'Výpočet kapacit'!$F$5:$F$59)=0),0)),\"\")","v":"45x5"},{"$f":"SUMIFS('Výpočet kapacit'!$G$5:$G$59,'Výpočet kapacit'!$F$5:$F$59,G9,'Výpočet kapacit'!$E$5:$E$59,H$7)/1000","v":0.64200000000000002},null,{"$f":"IFERROR(INDEX('Výpočet kapacit'!$F$5:$F$59,MATCH(1,('Výpočet kapacit'!$E$5:$E$59=K$7)*(COUNTIF(J$8:J8,'Výpočet kapacit'!$F$5:$F$59)=0),0)),\"\")","v":""},{"$f":"SUMIFS('Výpočet kapacit'!$G$5:$G$59,'Výpočet kapacit'!$F$5:$F$59,J9,'Výpočet kapacit'!$E$5:$E$59,K$7)/1000","v":0},null,{"$f":"IFERROR(INDEX('Výpočet kapacit'!$F$5:$F$59,MATCH(1,('Výpočet kapacit'!$E$5:$E$59=N$7)*(COUNTIF(M$8:M8,'Výpočet kapacit'!$F$5:$F$59)=0),0)),\"\")","v":""},{"$f":"SUMIFS('Výpočet kapacit'!$G$5:$G$59,'Výpočet kapacit'!$F$5:$F$59,M9,'Výpočet kapacit'!$E$5:$E$59,N$7)/1000","v":0},null,{"$f":"IFERROR(INDEX('Výpočet kapacit'!$F$5:$F$59,MATCH(1,('Výpočet kapacit'!$E$5:$E$59=Q$7)*(COUNTIF(P$8:P8,'Výpočet kapacit'!$F$5:$F$59)=0),0)),\"\")","v":""},{"$f":"SUMIFS('Výpočet kapacit'!$G$5:$G$59,'Výpočet kapacit'!$F$5:$F$59,P9,'Výpočet kapacit'!$E$5:$E$59,Q$7)/1000","v":0},null,{"$f":"IFERROR(INDEX('Výpočet kapacit'!$F$5:$F$59,MATCH(1,('Výpočet kapacit'!$E$5:$E$59=T$7)*(COUNTIF(S$8:S8,'Výpočet kapacit'!$F$5:$F$59)=0),0)),\"\")","v":""},{"$f":"SUMIFS('Výpočet kapacit'!$G$5:$G$59,'Výpočet kapacit'!$F$5:$F$59,S9,'Výpočet kapacit'!$E$5:$E$59,T$7)/1000","v":0},null,{"$f":"IFERROR(INDEX('Výpočet kapacit'!$F$5:$F$59,MATCH(1,('Výpočet kapacit'!$E$5:$E$59=W$7)*(COUNTIF(V$8:V8,'Výpočet kapacit'!$F$5:$F$59)=0),0)),\"\")","v":""},{"$f":"SUMIFS('Výpočet kapacit'!$G$5:$G$59,'Výpočet kapacit'!$F$5:$F$59,V9,'Výpočet kapacit'!$E$5:$E$59,W$7)/1000","v":0}]
[{"$f":"IFERROR(INDEX('Výpočet kapacit'!$F$5:$F$59,MATCH(1,('Výpočet kapacit'!$E$5:$E$59=B$7)*(COUNTIF(A$8:A9,'Výpočet kapacit'!$F$5:$F$59)=0),0)),\"\")","v":8},{"$f":"SUMIFS('Výpočet kapacit'!$G$5:$G$59,'Výpočet kapacit'!$F$5:$F$59,A10,'Výpočet kapacit'!$E$5:$E$59,B$7)/1000","v":4.3999999999999997E-2},null,{"$f":"IFERROR(INDEX('Výpočet kapacit'!$F$5:$F$59,MATCH(1,('Výpočet kapacit'!$E$5:$E$59=E$7)*(COUNTIF(D$8:D9,'Výpočet kapacit'!$F$5:$F$59)=0),0)),\"\")","v":15},{"$f":"SUMIFS('Výpočet kapacit'!$G$5:$G$59,'Výpočet kapacit'!$F$5:$F$59,D10,'Výpočet kapacit'!$E$5:$E$59,E$7)/1000","v":0.34},null,{"$f":"IFERROR(INDEX('Výpočet kapacit'!$F$5:$F$59,MATCH(1,('Výpočet kapacit'!$E$5:$E$59=H$7)*(COUNTIF(G$8:G9,'Výpočet kapacit'!$F$5:$F$59)=0),0)),\"\")","v":""},{"$f":"SUMIFS('Výpočet kapacit'!$G$5:$G$59,'Výpočet kapacit'!$F$5:$F$59,G10,'Výpočet kapacit'!$E$5:$E$59,H$7)/1000","v":0},null,{"$f":"IFERROR(INDEX('Výpočet kapacit'!$F$5:$F$59,MATCH(1,('Výpočet kapacit'!$E$5:$E$59=K$7)*(COUNTIF(J$8:J9,'Výpočet kapacit'!$F$5:$F$59)=0),0)),\"\")","v":""},{"$f":"SUMIFS('Výpočet kapacit'!$G$5:$G$59,'Výpočet kapacit'!$F$5:$F$59,J10,'Výpočet kapacit'!$E$5:$E$59,K$7)/1000","v":0},null,{"$f":"IFERROR(INDEX('Výpočet kapacit'!$F$5:$F$59,MATCH(1,('Výpočet kapacit'!$E$5:$E$59=N$7)*(COUNTIF(M$8:M9,'Výpočet kapacit'!$F$5:$F$59)=0),0)),\"\")","v":""},{"$f":"SUMIFS('Výpočet kapacit'!$G$5:$G$59,'Výpočet kapacit'!$F$5:$F$59,M10,'Výpočet kapacit'!$E$5:$E$59,N$7)/1000","v":0},null,{"$f":"IFERROR(INDEX('Výpočet kapacit'!$F$5:$F$59,MATCH(1,('Výpočet kapacit'!$E$5:$E$59=Q$7)*(COUNTIF(P$8:P9,'Výpočet kapacit'!$F$5:$F$59)=0),0)),\"\")","v":""},{"$f":"SUMIFS('Výpočet kapacit'!$G$5:$G$59,'Výpočet kapacit'!$F$5:$F$59,P10,'Výpočet kapacit'!$E$5:$E$59,Q$7)/1000","v":0},null,{"$f":"IFERROR(INDEX('Výpočet kapacit'!$F$5:$F$59,MATCH(1,('Výpočet kapacit'!$E$5:$E$59=T$7)*(COUNTIF(S$8:S9,'Výpočet kapacit'!$F$5:$F$59)=0),0)),\"\")","v":""},{"$f":"SUMIFS('Výpočet kapacit'!$G$5:$G$59,'Výpočet kapacit'!$F$5:$F$59,S10,'Výpočet kapacit'!$E$5:$E$59,T$7)/1000","v":0},null,{"$f":"IFERROR(INDEX('Výpočet kapacit'!$F$5:$F$59,MATCH(1,('Výpočet kapacit'!$E$5:$E$59=W$7)*(COUNTIF(V$8:V9,'Výpočet kapacit'!$F$5:$F$59)=0),0)),\"\")","v":""},{"$f":"SUMIFS('Výpočet kapacit'!$G$5:$G$59,'Výpočet kapacit'!$F$5:$F$59,V10,'Výpočet kapacit'!$E$5:$E$59,W$7)/1000","v":0}]
{"$rows_left_out":15}
{"sheet":"Seznam dílů","index":2,"n_rows":101,"n_cols":6,"rows_kept":101,"cut":false,"hidden":false,"merged":[]}
["Číslo dílu","Název dílu","Normový čas (s)","Jakost materiálu","Průměr/Rozměr","Délka kusu"]
["PPB-001.04.02","vložka",62,4301,16,25]
["PPB-001.06.04","čep 1 D8",22,4301,8,15]
["PPB-001.08.04","čep 2 D8",23,4301,8,21]
["PPB-001.10.02 a","osa ramene infuzáku",42,4301,16,94]
["PPB-001.10.03 b","dorazový čep 1",63,4301,10,52]
["PPB-001.10.04 b","dorazový čep 2",25,4301,10,22]
["PPB-001.10.05","trubka",170,11373,"45x5",100]
["PPB-001.10.06","knoflík",296,11373,55,27]
["PPB-001.16.01 a","šestihran 2",30,4301,"SW11",68]
{"$rows_left_out":92}
{"sheet":"Průměry","index":3,"n_rows":36,"n_cols":12,"rows_kept":36,"cut":false,"hidden":false,"merged":[]}
[4301,"Seznam průměrů"]
[4305,4,null,null,null,"Mezivýpočty 2 sloupec","Mezivýpočty 3 sloupec","Mezivýpočty 4 sloupec","Mezivýpočty 5 sloupec","Mezivýpočty 6 sloupec","Mezivýpočty 7 sloupec","Mezivýpočty 8 sloupec"]
[11373,5,null,null,null,{"$f":"IF('Seznam materiálu'!B4=Průměry!A2,0,IFERROR(VLOOKUP(Průměry!A2,'Výpočet kapacit'!E5:E59,1,FALSE),0))","v":4305},{"$f":"IF('Seznam materiálu'!B4=Průměry!A3,0,IF('Seznam materiálu'!E4=Průměry!A3,0,IF('Seznam materiálu'!B4=Průměry!A3,0,IF('Seznam materiálu'!E4=0,0,IFERROR(VLOOKUP(Průměry!A3,'Výpočet kapacit'!E5:E59,1,FALSE),0)))))","v":11373},{"$f":"IF(A4='Seznam materiálu'!B4,0,IF('Seznam materiálu'!H4=Průměry!A4,0,IF(F5='Seznam materiálu'!E4,0,IF('Seznam materiálu'!H4=0,0,IFERROR(VLOOKUP(Průměry!A4,'Výpočet kapacit'!E5:E59,1,FALSE),0)))))","v":0},{"$f":"IF(F6='Seznam materiálu'!E4,0,IF(G5='Seznam materiálu'!H4,0,IF('Seznam materiálu'!K4=Průměry!A5,0,IF('Seznam materiálu'!K4=0,0,IFERROR(VLOOKUP(Průměry!A5,'Výpočet kapacit'!E5:E59,1,FALSE),0)))))","v":0},{"$f":"IF(A6='Seznam materiálu'!B4,0,IF(F7='Seznam materiálu'!E4,0,IF(I4='Seznam materiálu'!N4,0,IF(H5='Seznam materiálu'!K4,0,IF(G6='Seznam materiálu'!H4,0,IF('Seznam materiálu'!N4=Průměry!A6,0,IFERROR(VLOOKUP(Průměry!A6,'Výpočet kapacit'!E5:E59,1,FALSE),0)))))))","v":0},{"$f":"IF(A7='Seznam materiálu'!B4,0,IF(J4='Seznam materiálu'!Q4,0,IF(I5='Seznam materiálu'!N4=0,0,IF(H6='Seznam materiálu'!K4,0,IF(G7='Seznam materiálu'!H4,0,IF(F8='Seznam materiálu'!E4,0,IF('Seznam materiálu'!Q4=0,0,IFERROR(VLOOKUP(Průměry!A$7,'Výpočet kapacit'!E$5:E$59,1,FALSE),0))))))))","v":0},{"$f":"IF(A8='Seznam materiálu'!B4,0,IF(K4='Seznam materiálu'!T4,0,IF(J5='Seznam materiálu'!Q4,0,IF(I6='Seznam materiálu'!N4,0,IF(H7='Seznam materiálu'!K4,0,IF(G8='Seznam materiálu'!H4,0,IF(F9='Seznam materiálu'!E4,0,IF('Seznam materiálu'!T4=0,0,IFERROR(VLOOKUP(Průměry!A8,'Výpočet kapacit'!E5:E59,1,FALSE),0)))))))))","v":0}]
[11523,6,null,null,null,{"$f":"IF('Seznam materiálu'!B4=Průměry!A3,0,IFERROR(VLOOKUP(A3,'Výpočet kapacit'!E5:E59,1,FALSE),0))","v":11373},{"$f":"IF('Seznam materiálu'!B4=Průměry!A4,0,IF('Seznam materiálu'!E4=Průměry!F5,0,IFERROR(VLOOKUP(A4,'Výpočet kapacit'!E5:E59,1,FALSE),0)))","v":0},{"$f":"IF(A5='Seznam materiálu'!B4,0,IF(F6='Seznam materiálu'!E$4,0,IF('Seznam materiálu'!H$4=Průměry!G5,0,IFERROR(VLOOKUP(A5,'Výpočet kapacit'!E$5:E$59,1,FALSE),0))))","v":0},{"$f":"IF(A6='Seznam materiálu'!B4,0,IF(H5='Seznam materiálu'!K4,0,IF(Průměry!F7='Seznam materiálu'!B4,0,IF(G6='Seznam materiálu'!H4,0,IF('Seznam materiálu'!K4=Průměry!A6,0,IF('Seznam materiálu'!K4=0,0,IFERROR(VLOOKUP(Průměry!A6,'Výpočet kapacit'!E6:E60,1,FALSE),0)))))))","v":0},{"$f":"IF(A7='Seznam materiálu'!B4,0,IF(I5='Seznam materiálu'!N4,0,IF(H6='Seznam materiálu'!K4,0,IF(G7='Seznam materiálu'!H4,0,IF(F8='Seznam materiálu'!E4,0,IF('Seznam materiálu'!N4=Průměry!A7,0,IFERROR(VLOOKUP(Průměry!A7,'Výpočet kapacit'!E5:E59,1,FALSE),0)))))))","v":0},{"$f":"IF(A8='Seznam materiálu'!B4,0,IF(J5='Seznam materiálu'!Q4,0,IF(I6='Seznam materiálu'!N4,0,IF(H7='Seznam materiálu'!K4,0,IF(G8='Seznam materiálu'!H4,0,IF(F9='Seznam materiálu'!E4,0,IFERROR(VLOOKUP(A8,'Výpočet kapacit'!E5:E59,1,FALSE),0)))))))","v":0}]
["PA6",8,null,null,null,{"$f":"IF('Seznam materiálu'!B4=Průměry!A4,0,IFERROR(VLOOKUP(A4,'Výpočet kapacit'!E5:E59,1,FALSE),0))","v":0},{"$f":"IF('Seznam materiálu'!B4=Průměry!A5,0,IF('Seznam materiálu'!E4=Průměry!F6,0,IFERROR(VLOOKUP(A5,'Výpočet kapacit'!E5:E59,1,FALSE),0)))","v":0},{"$f":"IF(A6='Seznam materiálu'!B4,0,IF(F7='Seznam materiálu'!E$4,0,IF('Seznam materiálu'!H$4=Průměry!G6,0,IFERROR(VLOOKUP(A6,'Výpočet kapacit'!E$5:E$59,1,FALSE),0))))","v":0},{"$f":"IF(A7='Seznam materiálu'!B4,0,IF(F8='Seznam materiálu'!B4,0,IF(G7='Seznam materiálu'!K4,0,IF(H6='Seznam materiálu'!K4,0,IF('Seznam materiálu'!K4=Průměry!A7,0,IF('Seznam materiálu'!K4=0,0,IFERROR(VLOOKUP(Průměry!A7,'Výpočet kapacit'!E5:E59,1,FALSE),0)))))))","v":0},{"$f":"IF(A8='Seznam materiálu'!B4,0,IF(I6='Seznam materiálu'!N4,0,IF(H7='Seznam materiálu'!K4,0,IF(G8='Seznam materiálu'!H4,0,IF(F9='Seznam materiálu'!E4,0,IF('Seznam materiálu'!N4=Průměry!A8,0,IFERROR(VLOOKUP(Průměry!A8,'Výpočet kapacit'!E5:E59,1,FALSE),0)))))))","v":0},{"$f":"IF(A9='Seznam materiálu'!B4,0,IF(J6='Seznam materiálu'!Q4,0,IF(I7='Seznam materiálu'!N4,0,IF(H8='Seznam materiálu'!K4,0,IF(G9='Seznam materiálu'!H4,0,IF(F10='Seznam materiálu'!E4,0,IFERROR(VLOOKUP(A9,'Výpočet kapacit'!E5:E59,1,FALSE),0)))))))","v":0}]
["Ertalon černý",10,null,null,null,{"$f":"IF('Seznam materiálu'!B4=Průměry!A5,0,IFERROR(VLOOKUP(A5,'Výpočet kapacit'!E5:E59,1,FALSE),0))","v":0},{"$f":"IF('Seznam materiálu'!B4=Průměry!A6,0,IF('Seznam materiálu'!E4=Průměry!F7,0,IFERROR(VLOOKUP(A6,'Výpočet kapacit'!E5:E59,1,FALSE),0)))","v":0},{"$f":"IF(A7='Seznam materiálu'!B4,0,IF(F8='Seznam materiálu'!E$4,0,IF('Seznam materiálu'!H$4=Průměry!G7,0,IFERROR(VLOOKUP(A7,'Výpočet kapacit'!E$5:E$59,1,FALSE),0))))","v":0},{"$f":"IF(A8='Seznam materiálu'!B4,0,IF('Seznam materiálu'!K4=Průměry!A8,0,IF('Seznam materiálu'!K4=0,0,IFERROR(VLOOKUP(Průměry!A8,'Výpočet kapacit'!E5:E49,1,FALSE),0))))","v":0},{"$f":"IF(A9='Seznam materiálu'!B4,0,IF(I7='Seznam materiálu'!N4,0,IF(H8='Seznam materiálu'!K4,0,IF(G9='Seznam materiálu'!H4,0,IF(F10='Seznam materiálu'!E4,0,IF('Seznam materiálu'!N4=Průměry!A9,0,IFERROR(VLOOKUP(Průměry!A9,'Výpočet kapacit'!E5:E59,1,FALSE),0)))))))","v":0}]
["EN2007",12,null,null,null,{"$f":"IF('Seznam materiálu'!B4=Průměry!A6,0,IFERROR(VLOOKUP(A6,'Výpočet kapacit'!E5:E59,1,FALSE),0))","v":0},{"$f":"IF('Seznam materiálu'!B4=Průměry!A7,0,IF('Seznam materiálu'!E4=Průměry!F8,0,IFERROR(VLOOKUP(A7,'Výpočet kapacit'!E5:E59,1,FALSE),0)))","v":0},{"$f":"IF(A8='Seznam materiálu'!B4,0,IF(F9='Seznam materiálu'!E$4,0,IF('Seznam materiálu'!H$4=Průměry!G8,0,IFERROR(VLOOKUP(A8,'Výpočet kapacit'!E$5:E$59,1,FALSE),0))))","v":0},{"$f":"IF(A9='Seznam materiálu'!B4,0,IF('Seznam materiálu'!K4=Průměry!A9,0,IF('Seznam materiálu'!K4=0,0,IFERROR(VLOOKUP(Průměry!A9,'Výpočet kapacit'!E5:E59,1,FALSE),0))))","v":0}]
["CuAl10Fe3Mn1,5",14,null,null,null,{"$f":"IF('Seznam materiálu'!B4=Průměry!A7,0,IFERROR(VLOOKUP(A7,'Výpočet kapacit'!E5:E59,1,FALSE),0))","v":0},{"$f":"IF('Seznam materiálu'!B4=Průměry!A8,0,IF('Seznam materiálu'!E4=Průměry!F9,0,IFERROR(VLOOKUP(A8,'Výpočet kapacit'!E5:E59,1,FALSE),0)))","v":0},{"$f":"IF(A9='Seznam materiálu'!B4,0,IF(F10='Seznam materiálu'!E$4,0,IF('Seznam materiálu'!H$4=Průměry!G9,0,IFERROR(VLOOKUP(A9,'Výpočet kapacit'!E$5:E$59,1,FALSE),0))))","v":0}]
["PA",15,null,null,null,{"$f":"IF('Seznam materiálu'!B4=Průměry!A8,0,IFERROR(VLOOKUP(A8,'Výpočet kapacit'!E5:E59,1,FALSE),0))","v":0},{"$f":"IF('Seznam materiálu'!B4=Průměry!A9,0,IF('Seznam materiálu'!E4=Průměry!F10,0,IFERROR(VLOOKUP(A9,'Výpočet kapacit'!E5:E59,1,FALSE),0)))","v":0}]
[null,16,null,null,null,{"$f":"IF('Seznam materiálu'!B4=Průměry!A9,0,IFERROR(VLOOKUP(A9,'Výpočet kapacit'!E5:E59,1,FALSE),0))","v":0}]
{"$rows_left_out":27}
{"sheet":"List1","index":4,"n_rows":94,"n_cols":8,"rows_kept":94,"cut":false,"hidden":false,"merged":[]}
["DIA-020.08 a","DIA-020.08 a",39,9.1999999999999993,120,{"$f":"(2400*0.14)/E1","v":2.8000000000000003},{"$f":"C1*0.18","v":7.02},{"$f":"D1-F1-G1","v":-0.62000000000000099}]
["DIA-ZP-003.01.03 b","DIA-ZP-003.01.03 b",112,24.1,40,{"$f":"(2400*0.14)/E2","v":8.4000000000000021},{"$f":"C2*0.18","v":20.16},{"$f":"D2-F2-G2","v":-4.4600000000000009}]
["DIA-ZP-003.01.04 a","DIA-ZP-003.01.04 a",70,53,40,8.4000000000000021,12.6,31.999999999999993]
["PPA-06.14 c","PPA-06.14 c",80,19.100000000000001,40,8.4000000000000021,14.399999999999999,-3.6999999999999993]
["PPA-06.19.05","PPA-06.19.05",29,8.6999999999999993,40,8.4000000000000021,5.22,-4.9200000000000026]
["PPA-077.01.03 b","PPA-077.01.03 b",130,100,80,4.2000000000000011,23.4,72.400000000000006]
["PPA-077.15 d","PPA-077.15 d",75,27.6,120,2.8000000000000003,13.5,11.3]
["PPA-102.07","PPA-102.07",57,14.4,"500",0.67200000000000015,10.26,3.468]
["PPA-24","PPA-24",25,7.3,60,5.6000000000000005,4.5,-2.8000000000000007]
["PPB-001.04.02","PPB-001.04.02",62,10.199999999999999,120,2.8000000000000003,11.16,-3.7600000000000016]
{"$rows_left_out":84}