{"text_format":"1","workbook":"xlsx","n_sheets":4,"sheets":["vyhledávání dílů","seznamy dílů_BalTec","seznamy dílů_TOX","seznamy dílů_Stöger"],"not_rendered":{"charts":0,"images":4,"macros":1,"external_links":0,"defined_names":0,"comments":0,"pivot_tables":0},"unopened":[],"bounds":{"document_bytes":16777216,"sheet_cells":100000,"rows_first":2000,"rows_last":500,"rows_between":2000,"halvings":0,"cell_chars":16384,"cell_head_chars":4096},"cells_cut":0,"cells_raw":0,"read":"whole","date_system":"1900"}

{"sheet":"vyhledávání dílů","index":0,"n_rows":29,"n_cols":11,"rows_kept":29,"cut":false,"hidden":false,"merged":[[24,0,29,0],[24,1,25,6],[24,7,29,7],[28,1,29,6],[0,1,1,6],[4,1,5,6],[0,7,5,7],[0,0,5,0],[12,0,17,0],[12,1,13,6],[12,7,17,7],[16,1,17,6]]}
[40034,"Vyhledávání skladových zásob BalTec"]
[null,null,null,null,null,null,null,null,null,null,"NENÍ SKLADEM"]
[null,"číslo hledaného dílu","český název","anglický název","pozice","počet","poznámka",null,null,null,"POSLEDNÍ POLOŽKA NA SKLADĚ"]
[null,"040034",{"$f":"IF(B4=0,K5,VLOOKUP(B4,'seznamy dílů_BalTec'!A1:G1550,3,FALSE))","v":0},{"$f":"IF(B4=0,K5,VLOOKUP(B4,'seznamy dílů_BalTec'!A1:G1550,4,FALSE))","v":"Oil hose PA/B 2,5 x 0,5 Mecanyl PA6"},{"$f":"IF(B4=0,K5,VLOOKUP(B4,'seznamy dílů_BalTec'!A1:G1550,5,FALSE))","v":0},{"$f":"IF(B4=0,0,VLOOKUP(B4,'seznamy dílů_BalTec'!A1:G1550,2,FALSE))","v":11},{"$f":"IF(B4=0,K5,VLOOKUP(B4,'seznamy dílů_BalTec'!A1:G1550,6,FALSE))","v":40034},null,null,null,"SKLADEM"]
[null,{"$f":"IF(B4<>'seznamy dílů_BalTec'!$H$2046,'vyhledávání dílů'!K6,IF(F4=0,K2,IF(F4=1,K3,K4)))","v":"#DÍL S TÍMTO ČÍSLEM NENÍ EVIDOVÁN V SEZNAMU DÍLŮ#"},null,null,null,null,null,null,null,null,"#VLOŽTE ČÍSLO DÍLU#"]
[null,null,null,null,null,null,null,null,null,null,"#DÍL S TÍMTO ČÍSLEM NENÍ EVIDOVÁN V SEZNAMU DÍLŮ#"]
[]
[]
[]
[]
[]
[]
[null,"Vyhledávání skladových zásob TOX"]
[]
[null,"číslo hledaného dílu","český název","anglický název","pozice","počet","poznámka"]
[null,"104610",{"$f":"IF(B16=0,K5,VLOOKUP(B16,'seznamy dílů_TOX'!A2:F100,3,FALSE))","v":"Doraz"},{"$f":"IF(B16=0,K5,VLOOKUP(B16,'seznamy dílů_TOX'!A2:F100,4,FALSE))","v":"Cushion"},{"$f":"IF(B16=0,K5,VLOOKUP(B16,'seznamy dílů_TOX'!A2:F100,5,FALSE))","v":0},{"$f":"IF(B16=0,0,VLOOKUP(B16,'seznamy dílů_TOX'!A2:F100,2,FALSE))","v":0},{"$f":"IF(B16=0,K5,VLOOKUP(B16,'seznamy dílů_TOX'!A2:F100,6,FALSE))","v":0}]
[null,{"$f":"IF(B16<>'seznamy dílů_TOX'!H100,'vyhledávání dílů'!K6,IF(F16=0,$K$2,IF(F16=1,$K$3,$K$4)))","v":"#DÍL S TÍMTO ČÍSLEM NENÍ EVIDOVÁN V SEZNAMU DÍLŮ#"}]
[]
[]
[]
[]
[]
[]
[]
[null,"Vyhledávání skladových zásob Stöger"]
[]
[null,"číslo hledaného dílu","český název","anglický název","pozice","počet","poznámka"]
[null,"210031",{"$f":"IF(B28=0,K5,VLOOKUP(B28,'seznamy dílů_Stöger'!A2:F100,3,FALSE))","v":"Sada těsnění"},{"$f":"IF(B28=0,K5,VLOOKUP(B28,'seznamy dílů_Stöger'!A2:F100,4,FALSE))","v":"Sealing kit"},{"$f":"IF(B28=0,K5,VLOOKUP(B28,'seznamy dílů_Stöger'!A2:F100,5,FALSE))","v":0},{"$f":"IF(B28=0,0,VLOOKUP(B28,'seznamy dílů_Stöger'!A2:F100,2,FALSE))","v":1},{"$f":"IF(B28=0,K5,VLOOKUP(B28,'seznamy dílů_Stöger'!A2:F100,6,FALSE))","v":0}]
[null,{"$f":"IF(B28<>'seznamy dílů_Stöger'!H100,'vyhledávání dílů'!K6,IF(F28=0,$K$2,IF(F28=1,$K$3,$K$4)))","v":"#DÍL S TÍMTO ČÍSLEM NENÍ EVIDOVÁN V SEZNAMU DÍLŮ#"}]

{"sheet":"seznamy dílů_BalTec","index":1,"n_rows":2046,"n_cols":17,"rows_kept":2046,"cut":false,"hidden":false,"merged":[]}
["040034",11,null,"Oil hose PA/B 2,5 x 0,5 Mecanyl PA6",null,{"$f":"VALUE(A1)","v":40034},{"$f":"IF(A1='vyhledávání dílů'!$B$4,'seznamy dílů_BalTec'!A1,0)","v":"040034"},null,{"$f":"TEXT(F1,\"000000\")","v":"040034"},null,1,"Key pad",null,null,null,0]
["040037",0,null,"Plastic hose, PA ø4/2.7, yellow",null,null,{"$f":"IF(A2='vyhledávání dílů'!$B$4,'seznamy dílů_BalTec'!A2,0)","v":0},null,null,null,null,"snímač elektromagnetického ventilu",null,null,null,3]
["040507",0,null,"Rubber mat strips black NBR Typ 2003, ripple scour 1000x13x3",null,null,{"$f":"IF(A3='vyhledávání dílů'!$B$4,'seznamy dílů_BalTec'!A3,0)","v":0},null,null,null,null,"kompletní řízení RC 10 s NS",null,null,null,1]
["040508",0,null,"Rubber mat strips black NBR Typ 2003, ripple scour 1000x19x3",null,null,{"$f":"IF(A4='vyhledávání dílů'!$B$4,'seznamy dílů_BalTec'!A4,0)","v":0},null,null,null,null,"Displej HPP 25 - samostatný"]
["040903",0,null,"Polyester rope spiral meshwork w/o core  ø1.7mm yellow",null,null,{"$f":"IF(A5='vyhledávání dílů'!$B$4,'seznamy dílů_BalTec'!A5,0)","v":0},null,null,null,null,"regulátor vzduchu s odlučovačem","???","???","???",0,"malá"]
["060030",0,null,"hydraulic oil HLP 32 ISO 32",null,null,{"$f":"IF(A6='vyhledávání dílů'!$B$4,'seznamy dílů_BalTec'!A6,0)","v":0},null,null,null,null,"vedení hřídele motoru pro RNEL","cam","p. ???","???",1,"RNEL malá "]
["060031",0,null,"High pressure gear oil OMALA 100",null,null,{"$f":"IF(A7='vyhledávání dílů'!$B$4,'seznamy dílů_BalTec'!A7,0)","v":0}]
["060035",0,null,"Air maintenance oil Mobilarma 522",null,null,{"$f":"IF(A8='vyhledávání dílů'!$B$4,'seznamy dílů_BalTec'!A8,0)","v":0}]
["060306",0,null,"Assembling grease Molykote G-Rapid paste 50g",null,null,{"$f":"IF(A9='vyhledávání dílů'!$B$4,'seznamy dílů_BalTec'!A9,0)","v":0}]
["060309",0,null,"Grease Kl\u0081uebersynth GE 46-1200 (1 kg)",null,null,{"$f":"IF(A10='vyhledávání dílů'!$B$4,'seznamy dílů_BalTec'!A10,0)","v":0}]
["060310",0,null,"Klueber paste 46 MR 401 (fitting grease 0.75 kg container)",null,null,{"$f":"IF(A11='vyhledávání dílů'!$B$4,'seznamy dílů_BalTec'!A11,0)","v":0}]
["060317",0,null,"Grease Kl\u0081uebersynth  (0.75 kg)",null,null,{"$f":"IF(A12='vyhledávání dílů'!$B$4,'seznamy dílů_BalTec'!A12,0)","v":0}]
["143277",0,"modul do servo lisu ",null,null,null,{"$f":"IF(A13='vyhledávání dílů'!$B$4,'seznamy dílů_BalTec'!A13,0)","v":0}]
["170004",0,null,"metal protective hose Type DE ø5/7 steel galvanised",null,null,{"$f":"IF(A14='vyhledávání dílů'!$B$4,'seznamy dílů_BalTec'!A14,0)","v":0}]
["250004",0,null,"Adhesive label: oil grades for air maintenance unit",null,null,{"$f":"IF(A15='vyhledávání dílů'!$B$4,'seznamy dílů_BalTec'!A15,0)","v":0}]
["250006",0,null,"Adhesive label:  MOBIL Mobil-DTE 24",null,null,{"$f":"IF(A16='vyhledávání dílů'!$B$4,'seznamy dílů_BalTec'!A16,0)","v":0}]
["270001",0,null,"Jerrican 0,5 l with cap S 5146 Z2",null,null,{"$f":"IF(A17='vyhledávání dílů'!$B$4,'seznamy dílů_BalTec'!A17,0)","v":0}]
["270002",0,null,"Jerrican 25 l UN 1350 G ",null,null,{"$f":"IF(A18='vyhledávání dílů'!$B$4,'seznamy dílů_BalTec'!A18,0)","v":0}]
["270003",0,null,"Can 0,25 l with screw cap",null,null,{"$f":"IF(A19='vyhledávání dílů'!$B$4,'seznamy dílů_BalTec'!A19,0)","v":0}]
["270021",0,null,"Jerrican 0.5 l Shell Omala 100 JSO",null,null,{"$f":"IF(A20='vyhledávání dílů'!$B$4,'seznamy dílů_BalTec'!A20,0)","v":0}]
["270023",0,null,"Jerrican 0.2 l Mobil DTE 24 ",null,null,{"$f":"IF(A21='vyhledávání dílů'!$B$4,'seznamy dílů_BalTec'!A21,0)","v":0}]
["310306",0,null,"Ball handle 1028-0-M8",null,null,{"$f":"IF(A22='vyhledávání dílů'!$B$4,'seznamy dílů_BalTec'!A22,0)","v":0}]
["312511",0,null,"Adjustment ring D= 16 DIN 705 A",null,null,{"$f":"IF(A23='vyhledávání dílů'!$B$4,'seznamy dílů_BalTec'!A23,0)","v":0}]
["314016",0,null,"washer spring C 8,0x4,2x0,2 DIN 2093",null,null,{"$f":"IF(A24='vyhledávání dílů'!$B$4,'seznamy dílů_BalTec'!A24,0)","v":0}]
["314057",0,null,"washer spring 31,5x16,3x1,5",null,null,{"$f":"IF(A25='vyhledávání dílů'!$B$4,'seznamy dílů_BalTec'!A25,0)","v":0}]
["314075",0,null,"washer spring C 45,0x22,4x1,25 DIN 2093",null,null,{"$f":"IF(A26='vyhledávání dílů'!$B$4,'seznamy dílů_BalTec'!A26,0)","v":0}]
["314214",0,null,"washer spring A 45,0x22,4x2,5 DIN 2093",null,null,{"$f":"IF(A27='vyhledávání dílů'!$B$4,'seznamy dílů_BalTec'!A27,0)","v":0}]
["314218",0,null,"washer spring A 71,0x36,0x4,0 DIN 2093",null,null,{"$f":"IF(A28='vyhledávání dílů'!$B$4,'seznamy dílů_BalTec'!A28,0)","v":0}]
["314243",0,null,"washer spring  B 71,0x36,0x2,5 DIN 2093",null,null,{"$f":"IF(A29='vyhledávání dílů'!$B$4,'seznamy dílů_BalTec'!A29,0)","v":0}]
["314252",0,null,"washer spring D 80,0 41,0x2,25 DIN 2093",null,null,{"$f":"IF(A30='vyhledávání dílů'!$B$4,'seznamy dílů_BalTec'!A30,0)","v":0}]
["314253",0,null,"washer spring B 80,0x41,0x3,0 DIN 2093",null,null,{"$f":"IF(A31='vyhledávání dílů'!$B$4,'seznamy dílů_BalTec'!A31,0)","v":0}]
["314254",0,null,"washer spring 80,0x41,0x4,0",null,null,{"$f":"IF(A32='vyhledávání dílů'!$B$4,'seznamy dílů_BalTec'!A32,0)","v":0}]
["314301",0,null,"washer spring 45,0x28,5x0,9",null,null,{"$f":"IF(A33='vyhledávání dílů'!$B$4,'seznamy dílů_BalTec'!A33,0)","v":0}]
["314407",0,null,"washer spring 23,7x14,3x0,4",null,null,{"$f":"IF(A34='vyhledávání dílů'!$B$4,'seznamy dílů_BalTec'!A34,0)","v":0}]
["314504",0,null,"Star spring D=61.0/d=40/s=1.15 1051.061.001",null,null,{"$f":"IF(A35='vyhledávání dílů'!$B$4,'seznamy dílů_BalTec'!A35,0)","v":0}]
["315203",0,null,"Spring key 2x2x10",null,null,{"$f":"IF(A36='vyhledávání dílů'!$B$4,'seznamy dílů_BalTec'!A36,0)","v":0}]
["315258",0,null,"Spring key 5x5x10 VSM 15161 A",null,null,{"$f":"IF(A37='vyhledávání dílů'!$B$4,'seznamy dílů_BalTec'!A37,0)","v":0}]
["315261",0,null,"Spring key 5x5x16 VSM 15161 A",null,null,{"$f":"IF(A38='vyhledávání dílů'!$B$4,'seznamy dílů_BalTec'!A38,0)","v":0}]
["316110",0,null,"Standard pressure spring 1,0x8,7x12,0",null,null,{"$f":"IF(A39='vyhledávání dílů'!$B$4,'seznamy dílů_BalTec'!A39,0)","v":0}]
["316136",0,null,"Standard pressure spring 1,25x6,8x13,0",null,null,{"$f":"IF(A40='vyhledávání dílů'!$B$4,'seznamy dílů_BalTec'!A40,0)","v":0}]
{"$rows_left_out":2007}
{"sheet":"seznamy dílů_TOX","index":2,"n_rows":100,"n_cols":18,"rows_kept":100,"cut":false,"hidden":false,"merged":[]}
["objednací č.","počet ","Název dílu česky","Název dílu anglicky ","výkr. Pozice","poznámky",null,null,null,null,null,null,"Název dílu česky","Název dílu anglicky ","výkr. Pozice","objednací č.","počet ","velikost"]
["104610",0,"Doraz","Cushion",null,null,{"$f":"IF(A2='vyhledávání dílů'!$B$16,'seznamy dílů_TOX'!A2,0)","v":"104610"},null,null,null,null,null,"Throttle valve","škrtící ventil",null,"Festo - 151215",1]
["105386",1,"Vodící pouzdro","Guide bush","p.39",null,{"$f":"IF(A3='vyhledávání dílů'!$B$16,'seznamy dílů_TOX'!A3,0)","v":0},null,null,null,null,null,"Throttle valve","škrtící ventil",null,"Festo - 193145",2]
["108802",2,"nástrojvý držák","Tool holder",null,null,{"$f":"IF(A4='vyhledávání dílů'!$B$16,'seznamy dílů_TOX'!A4,0)","v":0},null,null,null,null,null,"Throttle valve","škrtící ventil",null,"Festo - 193147",2]
["110659",1,"Doraz","Cushion",null,null,{"$f":"IF(A5='vyhledávání dílů'!$B$16,'seznamy dílů_TOX'!A5,0)","v":0},null,null,null,null,null,"Throttle valve","škrtící ventil",null,"Festo - 193151",4]
["110666",8,"Tlumič","Muffler ","p.51",null,{"$f":"IF(A6='vyhledávání dílů'!$B$16,'seznamy dílů_TOX'!A6,0)","v":0},null,null,null,null,null,"Throttle valve","škrtící ventil",null,"Festo - 193152",4]
["110674",4,"Tlumič","Muffler ","p.54",null,{"$f":"IF(A7='vyhledávání dílů'!$B$16,'seznamy dílů_TOX'!A7,0)","v":0},null,null,null,null,null,"Bypass","Bypass","p.677",null,2,"S 8. 50. 12 D (použitý)"]
["110689",1,"Mechanická pružina","Compression spring","P.50",null,{"$f":"IF(A8='vyhledávání dílů'!$B$16,'seznamy dílů_TOX'!A8,0)","v":0},null,null,null,null,null,"Bypass","Bypass","p.677",null,1,"S 04. 300. 12 D (použitý)"]
["150359",6,"Plnící olejový nipl","Oil refill nipple","p.62",null,{"$f":"IF(A9='vyhledávání dílů'!$B$16,'seznamy dílů_TOX'!A9,0)","v":0},null,null,null,null,null,"Cushion","Doraz",null,null,1,"Sada pro S 8"]
["150369",2,"Vysokotlaký měřící bod G 1/4","HP measuring connector","p.30 Velký",null,{"$f":"IF(A10='vyhledávání dílů'!$B$16,'seznamy dílů_TOX'!A10,0)","v":0},null,null,null,null,null,"Cushion","Doraz",null,null,null,"Sada pro S 4"]
["150370",24,"Tlumič","Muffler ","p.51",null,{"$f":"IF(A11='vyhledávání dílů'!$B$16,'seznamy dílů_TOX'!A11,0)","v":0},null,null,null,null,null,"Cushion","Doraz",null,null,1,"Sada pro S 2"]
["150576",5,"Tlumič","Muffler ","p.51",null,{"$f":"IF(A12='vyhledávání dílů'!$B$16,'seznamy dílů_TOX'!A12,0)","v":0},null,null,null,null,null,"Cushion","Doraz",null,null,1,"Sada pro S 1"]
["151877",13,"Tlumič","Muffler ","p.51",null,{"$f":"IF(A13='vyhledávání dílů'!$B$16,'seznamy dílů_TOX'!A13,0)","v":0},null,null,null,null,null,"Cushion","Doraz",null,null,1,"Sada pro S 15"]
["151879",9,"Tlumič","Muffler ","p.54",null,{"$f":"IF(A14='vyhledávání dílů'!$B$16,'seznamy dílů_TOX'!A14,0)","v":0},null,null,null,null,null,"Ex. Silový ventil","Ex. Power stroke valve","p.53",null,2,"použité"]
["155800",6,"Vysokotlaký měřící bod M8x1","HP measuring connector","p.30 Malý",null,{"$f":"IF(A15='vyhledávání dílů'!$B$16,'seznamy dílů_TOX'!A15,0)","v":0},null,null,null,null,null,"Feed piston","Přítlačný píst","p.2",null,1,"S 4"]
["156669",1,"Mechanická pružina","Compression spring","p.50",null,{"$f":"IF(A16='vyhledávání dílů'!$B$16,'seznamy dílů_TOX'!A16,0)","v":0},null,null,null,null,null,"Mechanická pružina","Compression spring","p.50",null,1,"S 15. 32. 3"]
["164773",1,"Mechanická pružina","Compression spring","p.50",null,{"$f":"IF(A17='vyhledávání dílů'!$B$16,'seznamy dílů_TOX'!A17,0)","v":0},null,null,null,null,null,"Mechanická pružina","Compression spring","p.50",null,1,"S 4"]
["165433",1,"Tlumič","Muffler ","p.51",null,{"$f":"IF(A18='vyhledávání dílů'!$B$16,'seznamy dílů_TOX'!A18,0)","v":0},null,null,null,null,null,"Oil indicator needle","Indikátor hladiny oleje","p.79,81",null,51]
["167480",2,"Rovné šroubení","Straight screwing",null,null,{"$f":"IF(A19='vyhledávání dílů'!$B$16,'seznamy dílů_TOX'!A19,0)","v":0},null,null,null,null,null,"Tool holder","nástrojvý držák",null,null,1]
["170969",2,"nástrojvý držák","Tool holder",null,null,{"$f":"IF(A20='vyhledávání dílů'!$B$16,'seznamy dílů_TOX'!A20,0)","v":0}]
["171858",6,"Tlumič","Screw fitting","p.443",null,{"$f":"IF(A21='vyhledávání dílů'!$B$16,'seznamy dílů_TOX'!A21,0)","v":0}]
["176591",1,"Mechanická pružina","Compression spring","p.50",null,{"$f":"IF(A22='vyhledávání dílů'!$B$16,'seznamy dílů_TOX'!A22,0)","v":0}]
["210084",9,"X - ventil","Control throttle \"X\"","p.61",null,{"$f":"IF(A23='vyhledávání dílů'!$B$16,'seznamy dílů_TOX'!A23,0)","v":0}]
["215375",1,"Pneumatická pružina","Pressure regulator","p.461","malá",{"$f":"IF(A24='vyhledávání dílů'!$B$16,'seznamy dílů_TOX'!A24,0)","v":0}]
["218599",1,"Mechanická pružina","Compression spring","p.50","K 01. 50. 05 (contitnetal)",{"$f":"IF(A25='vyhledávání dílů'!$B$16,'seznamy dílů_TOX'!A25,0)","v":0}]
["242398",0,"Plnící hadička",null,null,null,{"$f":"IF(A26='vyhledávání dílů'!$B$16,'seznamy dílů_TOX'!A26,0)","v":0}]
["249593",10,"Tlumič","Muffler ","p.54",null,{"$f":"IF(A27='vyhledávání dílů'!$B$16,'seznamy dílů_TOX'!A27,0)","v":0}]
["322995",1,"Plunžr","Plunger piston","p.609","S 1",{"$f":"IF(A28='vyhledávání dílů'!$B$16,'seznamy dílů_TOX'!A28,0)","v":0}]
["338925",1,"Bypass","Bypass","P.677",null,{"$f":"IF(A29='vyhledávání dílů'!$B$16,'seznamy dílů_TOX'!A29,0)","v":0}]
["338926",1,"Bypass","Bypass","p.677",null,{"$f":"IF(A30='vyhledávání dílů'!$B$16,'seznamy dílů_TOX'!A30,0)","v":0}]
[null,null,null,null,null,null,{"$f":"IF(A31='vyhledávání dílů'!$B$16,'seznamy dílů_TOX'!A31,0)","v":0}]
[null,null,null,null,null,null,{"$f":"IF(A32='vyhledávání dílů'!$B$16,'seznamy dílů_TOX'!A32,0)","v":0}]
[null,null,null,null,null,null,{"$f":"IF(A33='vyhledávání dílů'!$B$16,'seznamy dílů_TOX'!A33,0)","v":0}]
[null,null,null,null,null,null,{"$f":"IF(A34='vyhledávání dílů'!$B$16,'seznamy dílů_TOX'!A34,0)","v":0}]
[null,null,null,null,null,null,{"$f":"IF(A35='vyhledávání dílů'!$B$16,'seznamy dílů_TOX'!A35,0)","v":0}]
[null,null,null,null,null,null,{"$f":"IF(A36='vyhledávání dílů'!$B$16,'seznamy dílů_TOX'!A36,0)","v":0}]
[null,null,null,null,null,null,{"$f":"IF(A37='vyhledávání dílů'!$B$16,'seznamy dílů_TOX'!A37,0)","v":0}]
[null,null,null,null,null,null,{"$f":"IF(A38='vyhledávání dílů'!$B$16,'seznamy dílů_TOX'!A38,0)","v":0}]
[null,null,null,null,null,null,{"$f":"IF(A39='vyhledávání dílů'!$B$16,'seznamy dílů_TOX'!A39,0)","v":0}]
[null,null,null,null,null,null,{"$f":"IF(A40='vyhledávání dílů'!$B$16,'seznamy dílů_TOX'!A40,0)","v":0}]
{"$rows_left_out":61}
{"sheet":"seznamy dílů_Stöger","index":3,"n_rows":100,"n_cols":8,"rows_kept":100,"cut":false,"hidden":false,"merged":[]}
["Obj. číslo dílce","počet kusů","Název česky","Název Aj"]
["210031",1,"Sada těsnění","Sealing kit",null,null,{"$f":"IF(A2='vyhledávání dílů'!$B$28,'seznamy dílů_Stöger'!A2,0)","v":"210031"}]
["210121",1,"Sada ložisek","Bearing kit",null,null,{"$f":"IF(A3='vyhledávání dílů'!$B$28,'seznamy dílů_Stöger'!A3,0)","v":0}]
["201321",2,"Pružinová podložka","Disc spring ",null,null,{"$f":"IF(A4='vyhledávání dílů'!$B$28,'seznamy dílů_Stöger'!A4,0)","v":0}]
["SPS 2021 000 0000 11",4,"Pouzdro (futro)","Bearing nut",null,null,{"$f":"IF(A5='vyhledávání dílů'!$B$28,'seznamy dílů_Stöger'!A5,0)","v":0}]
["202121",10,"Pojistný kroužek","Circlip",null,null,{"$f":"IF(A6='vyhledávání dílů'!$B$28,'seznamy dílů_Stöger'!A6,0)","v":0}]
["202043",10,"Pojistný kroužek","Circlip",null,null,{"$f":"IF(A7='vyhledávání dílů'!$B$28,'seznamy dílů_Stöger'!A7,0)","v":0}]
["202122",10,"Pojistný kroužek","Circlip",null,null,{"$f":"IF(A8='vyhledávání dílů'!$B$28,'seznamy dílů_Stöger'!A8,0)","v":0}]
["202010",10,"Pojistný kroužek","Circlip",null,null,{"$f":"IF(A9='vyhledávání dílů'!$B$28,'seznamy dílů_Stöger'!A9,0)","v":0}]
["202046",10,"Pojistný kroužek","Circlip",null,null,{"$f":"IF(A10='vyhledávání dílů'!$B$28,'seznamy dílů_Stöger'!A10,0)","v":0}]
["203099",5,"Šroub (červ)","Set Screw",null,null,{"$f":"IF(A11='vyhledávání dílů'!$B$28,'seznamy dílů_Stöger'!A11,0)","v":0}]
["203075",10,"Válcový kolík","Cylinder pin",null,null,{"$f":"IF(A12='vyhledávání dílů'!$B$28,'seznamy dílů_Stöger'!A12,0)","v":0}]
["203107",4,"Nástrčný šroub s kulovou hlavou","Spherical headed socket scr",null,null,{"$f":"IF(A13='vyhledávání dílů'!$B$28,'seznamy dílů_Stöger'!A13,0)","v":0}]
["203029",10,"Válcový šroub","Cylinder screw",null,null,{"$f":"IF(A14='vyhledávání dílů'!$B$28,'seznamy dílů_Stöger'!A14,0)","v":0}]
["KLH 2001 000 0000 15",6,"Napínací šroub","Tension screw",null,null,{"$f":"IF(A15='vyhledávání dílů'!$B$28,'seznamy dílů_Stöger'!A15,0)","v":0}]
["KLH 2001 000 0000 14",8,"Polštářová podložka","Cushion washer",null,null,{"$f":"IF(A16='vyhledávání dílů'!$B$28,'seznamy dílů_Stöger'!A16,0)","v":0}]
["SDH 2001 002 0001 00",1,"Spojka nosné hřídele","Carrier shaft cpl.",null,null,{"$f":"IF(A17='vyhledávání dílů'!$B$28,'seznamy dílů_Stöger'!A17,0)","v":0}]
["SDH 2001 000 0003 00",1,"Magnetický blok","Magnetic block",null,null,{"$f":"IF(A18='vyhledávání dílů'!$B$28,'seznamy dílů_Stöger'!A18,0)","v":0}]
["SDH 2001 002 0000 10",1,"Pouzdro pístu","Piston sleeve ",null,null,{"$f":"IF(A19='vyhledávání dílů'!$B$28,'seznamy dílů_Stöger'!A19,0)","v":0}]
["210096",1,"Sada těsnění","Sealing kit",null,null,{"$f":"IF(A20='vyhledávání dílů'!$B$28,'seznamy dílů_Stöger'!A20,0)","v":0}]
["210475",1,"Sada těsnění","Sealing kit",null,null,{"$f":"IF(A21='vyhledávání dílů'!$B$28,'seznamy dílů_Stöger'!A21,0)","v":0}]
["210095",1,"Sada těsnění","Sealing kit",null,null,{"$f":"IF(A22='vyhledávání dílů'!$B$28,'seznamy dílů_Stöger'!A22,0)","v":0}]
["210122",1,"Sada ložisek","Bearing Kit ",null,null,{"$f":"IF(A23='vyhledávání dílů'!$B$28,'seznamy dílů_Stöger'!A23,0)","v":0}]
["KLH 2501 000 0000 13",8,"Polštářová podložka","Cushion washer",null,null,{"$f":"IF(A24='vyhledávání dílů'!$B$28,'seznamy dílů_Stöger'!A24,0)","v":0}]
["KLH 2501 000 0000 15",6,"Napínací šroub","Tension screw",null,null,{"$f":"IF(A25='vyhledávání dílů'!$B$28,'seznamy dílů_Stöger'!A25,0)","v":0}]
["202011",10,"Pojistný kroužek","Circlip",null,null,{"$f":"IF(A26='vyhledávání dílů'!$B$28,'seznamy dílů_Stöger'!A26,0)","v":0}]
["202031",10,"Pojistný kroužek","Circlip",null,null,{"$f":"IF(A27='vyhledávání dílů'!$B$28,'seznamy dílů_Stöger'!A27,0)","v":0}]
["202032",10,"Pojistný kroužek","Circlip",null,null,{"$f":"IF(A28='vyhledávání dílů'!$B$28,'seznamy dílů_Stöger'!A28,0)","v":0}]
["202012",10,"Pojistný kroužek","Circlip",null,null,{"$f":"IF(A29='vyhledávání dílů'!$B$28,'seznamy dílů_Stöger'!A29,0)","v":0}]
["SDH 2501 003 0001 00",1,"Spojka nosné hřídele","Carrier shaft cpl.",null,null,{"$f":"IF(A30='vyhledávání dílů'!$B$28,'seznamy dílů_Stöger'!A30,0)","v":0}]
["SDH 2501 003 0000 10",1,"Pouzdro pístu","Piston sleeve ",null,null,{"$f":"IF(A31='vyhledávání dílů'!$B$28,'seznamy dílů_Stöger'!A31,0)","v":0}]
["SDH 2501 000 0003 00",1,"Magnetický blok","Magnetic block",null,null,{"$f":"IF(A32='vyhledávání dílů'!$B$28,'seznamy dílů_Stöger'!A32,0)","v":0}]
["202115",10,"Pojistný kroužek","Circlip",null,null,{"$f":"IF(A33='vyhledávání dílů'!$B$28,'seznamy dílů_Stöger'!A33,0)","v":0}]
["203189",5,"Stavěcí šroub","Set Screw",null,null,{"$f":"IF(A34='vyhledávání dílů'!$B$28,'seznamy dílů_Stöger'!A34,0)","v":0}]
["201320",4,"Pružinová podložka","Disc spring ",null,null,{"$f":"IF(A35='vyhledávání dílů'!$B$28,'seznamy dílů_Stöger'!A35,0)","v":0}]
["SPS 1621 000 0000 11",4,"ložisková matice","Bearing nut",null,null,{"$f":"IF(A36='vyhledávání dílů'!$B$28,'seznamy dílů_Stöger'!A36,0)","v":0}]
["203098",4,"Nástrčný šroub s kulovou hlavou","Spherical headed socket scr",null,null,{"$f":"IF(A37='vyhledávání dílů'!$B$28,'seznamy dílů_Stöger'!A37,0)","v":0}]
["203017",10,"Válcový šroub","Cylinder screw",null,null,{"$f":"IF(A38='vyhledávání dílů'!$B$28,'seznamy dílů_Stöger'!A38,0)","v":0}]
["KLH 1601 000 0000 14",6,"Polštářová podložka","Cushion washer",null,null,{"$f":"IF(A39='vyhledávání dílů'!$B$28,'seznamy dílů_Stöger'!A39,0)","v":0}]
["KLH 1601 000 0000 15",8,"Napínací šroub","Tension screw",null,null,{"$f":"IF(A40='vyhledávání dílů'!$B$28,'seznamy dílů_Stöger'!A40,0)","v":0}]
{"$rows_left_out":60}