{"text_format":"1","workbook":"xlsx","n_sheets":3,"sheets":["dotaz","Podmienený format","Makro"],"not_rendered":{"charts":0,"images":0,"macros":1,"external_links":0,"defined_names":0,"comments":0,"pivot_tables":0},"unopened":[],"bounds":{"document_bytes":16777216,"sheet_cells":100000,"rows_first":2000,"rows_last":500,"rows_between":2000,"halvings":0,"cell_chars":16384,"cell_head_chars":4096},"cells_cut":0,"cells_raw":0,"read":"whole","date_system":"1900"}

{"sheet":"dotaz","index":0,"n_rows":48,"n_cols":12,"rows_kept":48,"cut":false,"hidden":false,"merged":[]}
["Zdroj tab.1",null,null,null,null,null,null,null,null,"Výsledek"]
[null,1,"ano",null,null,null,null,null,null,null,1,"ano"]
[null,2,"ano",null,null,null,null,null,null,null,2,"ano"]
[null,"3","ano",null,null,null,null,null,null,null,"3","ano"]
[null,"4","ano",null,null,null,null,null,null,null,"4","ano"]
[null,"5","ano",null,null,null,null,null,null,null,"5","ano"]
[null,"6","ne",null,null,null,null,null,null,"skryté řádky \"ne\" (nikoli odstraněné!!!)"]
[null,"7","ne"]
[null,"8","ne"]
[null,"9","ne"]
[null,"10","ne"]
[null,"11","ne"]
[null,"12","ne"]
[null,"atd."]
[]
[]
[]
["Zdroj tab.2",null,null,null,null,null,null,null,null,"Výsledek"]
[null,1,"ano",null,null,null,null,null,null,null,1,"ano"]
[null,2,"ano",null,null,null,null,null,null,null,2,"ano"]
[null,"3","ne",null,null,null,null,null,null,"skryté řádky \"ne\" (nikoli odstraněné!!!)"]
[null,"4","ne"]
[null,"5","ne"]
[null,"6","ne"]
[null,"7","ne"]
[null,"8","ne"]
[null,"9","ne"]
[null,"10","ne"]
[null,"11","ne"]
[null,"12","ne"]
[null,"atd."]
[]
[]
[]
["Zdroj tab.3",null,null,null,null,null,null,null,null,"Výsledek",1,"ano"]
[null,1,"ano",null,null,null,null,null,null,null,2,"ano"]
[null,2,"ano",null,null,null,null,null,null,null,"3","ano"]
[null,"3","ano",null,null,null,null,null,null,null,"4","ano"]
[null,"4","ano",null,null,null,null,null,null,null,"5","ano"]
[null,"5","ano",null,null,null,null,null,null,null,"6","ano"]
[null,"6","ano",null,null,null,null,null,null,null,"7","ano"]
[null,"7","ano",null,null,null,null,null,null,null,"8","ano"]
[null,"8","ano",null,null,null,null,null,null,null,"9","ano"]
[null,"9","ano",null,null,null,null,null,null,"skryté řádky \"ne\" (nikoli odstraněné!!!)"]
[null,"10","ne"]
[null,"11","ne"]
[null,"12","ne"]
[null,"atd."]

{"sheet":"Podmienený format","index":1,"n_rows":14,"n_cols":7,"rows_kept":14,"cut":false,"hidden":false,"merged":[]}
[null,"PC","Výsledok","Meno","počet C",null,6]
[null,{"$f":"ROWS(B$2:B2)","v":1},{"$f":"IF(Table1[[#This Row],[PC]]<=$G$1,\"ano\",\"nie\")","v":"ano"},"Adam",{"$f":"COUNTIF(C$2:C2,C2)","v":1},"$B2=\"nie\""]
[null,{"$f":"ROWS(B$2:B3)","v":2},{"$f":"IF(Table1[[#This Row],[PC]]<=$G$1,\"ano\",\"nie\")","v":"ano"},"Juraj",{"$f":"COUNTIF(C$2:C3,C3)","v":2}]
[null,{"$f":"ROWS(B$2:B4)","v":3},{"$f":"IF(Table1[[#This Row],[PC]]<=$G$1,\"ano\",\"nie\")","v":"ano"},"Peter",{"$f":"COUNTIF(C$2:C4,C4)","v":3}]
[null,{"$f":"ROWS(B$2:B5)","v":4},{"$f":"IF(Table1[[#This Row],[PC]]<=$G$1,\"ano\",\"nie\")","v":"ano"},"Ivana",{"$f":"COUNTIF(C$2:C5,C5)","v":4}]
[null,{"$f":"ROWS(B$2:B6)","v":5},{"$f":"IF(Table1[[#This Row],[PC]]<=$G$1,\"ano\",\"nie\")","v":"ano"},"Jana",{"$f":"COUNTIF(C$2:C6,C6)","v":5}]
[null,{"$f":"ROWS(B$2:B7)","v":6},{"$f":"IF(Table1[[#This Row],[PC]]<=$G$1,\"ano\",\"nie\")","v":"ano"},"Júlia",{"$f":"COUNTIF(C$2:C7,C7)","v":6}]
[null,{"$f":"ROWS(B$2:B8)","v":7},{"$f":"IF(Table1[[#This Row],[PC]]<=$G$1,\"ano\",\"nie\")","v":"nie"},"Jaroslava",{"$f":"COUNTIF(C$2:C8,C8)","v":1}]
[null,{"$f":"ROWS(B$2:B9)","v":8},{"$f":"IF(Table1[[#This Row],[PC]]<=$G$1,\"ano\",\"nie\")","v":"nie"},"Mária",{"$f":"COUNTIF(C$2:C9,C9)","v":2}]
[null,{"$f":"ROWS(B$2:B10)","v":9},{"$f":"IF(Table1[[#This Row],[PC]]<=$G$1,\"ano\",\"nie\")","v":"nie"},"Tatiana",{"$f":"COUNTIF(C$2:C10,C10)","v":3}]
[null,{"$f":"ROWS(B$2:B11)","v":10},{"$f":"IF(Table1[[#This Row],[PC]]<=$G$1,\"ano\",\"nie\")","v":"nie"},"Monika",{"$f":"COUNTIF(C$2:C11,C11)","v":4}]
[null,{"$f":"ROWS(B$2:B12)","v":11},{"$f":"IF(Table1[[#This Row],[PC]]<=$G$1,\"ano\",\"nie\")","v":"nie"},"Milka",{"$f":"COUNTIF(C$2:C12,C12)","v":5}]
[null,{"$f":"ROWS(B$2:B13)","v":12},{"$f":"IF(Table1[[#This Row],[PC]]<=$G$1,\"ano\",\"nie\")","v":"nie"},"Petra",{"$f":"COUNTIF(C$2:C13,C13)","v":6}]
[null,{"$f":"ROWS(B$2:B14)","v":13},{"$f":"IF(Table1[[#This Row],[PC]]<=$G$1,\"ano\",\"nie\")","v":"nie"},"Igor",{"$f":"COUNTIF(C$2:C14,C14)","v":7}]

{"sheet":"Makro","index":2,"n_rows":48,"n_cols":13,"rows_kept":48,"cut":false,"hidden":false,"merged":[]}
["Zdroj tab.1",null,null,null,null,null,null,null,null,null,null,"ne","C"]
[null,1,"ano"]
[null,2,"ano"]
[null,"3","ne"]
[null,"4","ano"]
[null,"5","ano"]
[null,"6","ne"]
[null,"7","ne"]
[null,"8","ne"]
[null,"9","ne"]
[null,"10","ne"]
[null,"11","ne"]
[null,"12","ne"]
[null,"atd."]
[]
[]
[]
["Zdroj tab.2"]
[null,1,"ano"]
[null,2,"ano"]
[null,"3","ne"]
[null,"4","ne"]
[null,"5","ne"]
[null,"6","ne"]
[null,"7","ne"]
[null,"8","ne"]
[null,"9","ne"]
[null,"10","ne"]
[null,"11","ne"]
[null,"12","ne"]
[null,"atd."]
[]
[]
[]
["Zdroj tab.3"]
[null,1,"ano"]
[null,2,"ano"]
[null,"3","ano"]
[null,"4","ano"]
[null,"5","ano"]
[null,"6","ano"]
[null,"7","ano"]
[null,"8","ano"]
[null,"9","ano"]
[null,"10","ne"]
[null,"11","ne"]
[null,"12","ne"]
[null,"atd."]