{"text_format":"1","workbook":"xlsx","n_sheets":6,"sheets":["SaP","Rozdelenie","A","B","C","www"],"not_rendered":{"charts":0,"images":0,"macros":1,"external_links":0,"defined_names":9,"comments":0,"pivot_tables":0},"unopened":[],"bounds":{"document_bytes":16777216,"sheet_cells":100000,"rows_first":2000,"rows_last":500,"rows_between":2000,"halvings":0,"cell_chars":16384,"cell_head_chars":4096},"cells_cut":0,"cells_raw":0,"read":"whole","date_system":"1900"}

{"sheet":"SaP","index":0,"n_rows":150,"n_cols":11,"rows_kept":150,"cut":false,"hidden":true,"merged":[]}
["príslušník",null,"zmena",null,"počet",null,"príslušník2",null,"stav"]
["A",null,"A",null,4,null,"a",null,"-",null,"-"]
["B",null,"B",null,5,null,"b",null,"OK",null,"Stanica"]
["C",null,"C",null,6,null,"c",null,"Oprava",null,"Mimo"]
["D",null,null,null,7,null,"d",null,"Mimo prevádzky",null,"Servis"]
["E",null,null,null,8,null,"e"]
["F",null,null,null,9,null,"f"]
["G",null,null,null,10,null,"g"]
["-",null,null,null,11,null,"-"]
["-",null,null,null,12,null,"-"]
["-",null,null,null,13,null,"-"]
["-",null,null,null,14,null,"-"]
["-",null,null,null,null,null,"-"]
["-",null,null,null,null,null,"-"]
["-",null,null,null,null,null,"-"]
["H",null,null,null,null,null,"h"]
["I",null,null,null,null,null,"i"]
["J",null,null,null,null,null,"j"]
["K",null,null,null,null,null,"k"]
["L",null,null,null,null,null,"l"]
["M",null,null,null,null,null,"m"]
["N",null,null,null,null,null,"n"]
["-",null,null,null,null,null,"-"]
["-",null,null,null,null,null,"-"]
["-",null,null,null,null,null,"-"]
["-",null,null,null,null,null,"-"]
["-",null,null,null,null,null,"-"]
["-",null,null,null,null,null,"-"]
["-",null,null,null,null,null,"-"]
["O",null,null,null,null,null,"o"]
["P",null,null,null,null,null,"p"]
["R",null,null,null,null,null,"r"]
["S",null,null,null,null,null,"s"]
["T",null,null,null,null,null,"t"]
["U",null,null,null,null,null,"u"]
["V",null,null,null,null,null,"v"]
["-",null,null,null,null,null,"-"]
["-",null,null,null,null,null,"-"]
["-",null,null,null,null,null,"-"]
["-",null,null,null,null,null,"-"]
["-",null,null,null,null,null,"-"]
["-",null,null,null,null,null,"-"]
["-",null,null,null,null,null,"-"]
[]
[]
[]
[]
[]
[]
[]
[]
[]
[]
[]
["-",null,null,null,null,null,"-"]
[]
[]
[]
[]
["Technika"]
[1]
[2]
[3]
[4]
[5]
[6]
[7]
[8]
[9]
[10]
[11]
[12]
[13]
[14]
[15]
[16]
[17]
[18]
[19]
[20]
[21]
[22]
[23]
[24]
[25]
[26]
[27]
[28]
[29]
[30]
[31]
["-"]
["-"]
["-"]
["-"]
["-"]
["-"]
["-"]
["-"]
[32]
[33]
[34]
[35]
[36]
[37]
[38]
[39]
[40]
[41]
[42]
[43]
[44]
[45]
[46]
[47]
[48]
["-"]
["-"]
["-"]
[49]
[50]
[51]
[52]
[53]
["-"]
["-"]
["-"]
["-"]
["-"]
["-"]
["-"]
["-"]
["-"]
["-"]
["-"]
["-"]
["-"]
["-"]
["-"]
["-"]
["-"]
["-"]
["-"]
["-"]
["-"]
["-"]
["-"]
["-"]
["-"]
["-"]

{"sheet":"Rozdelenie","index":1,"n_rows":44,"n_cols":16,"rows_kept":44,"cut":false,"hidden":false,"merged":[[5,1,5,2],[6,9,6,10],[10,3,10,4],[10,5,10,6],[34,1,35,1],[36,1,37,1],[38,1,39,1],[40,1,41,1],[23,1,24,1],[25,1,26,1],[27,1,28,1],[29,1,30,1],[32,1,33,1],[17,1,18,1],[19,1,20,1],[21,1,22,1],[6,1,6,2],[7,1,7,2],[8,1,8,2],[9,1,9,2],[10,1,10,2],[11,1,11,2],[12,1,12,2],[13,1,13,2],[14,1,14,2],[9,3,9,4],[8,9,8,10],[8,7,8,8],[8,5,8,6],[8,3,8,4],[7,9,7,10],[7,7,7,8],[7,5,7,6],[7,3,7,4],[2,1,4,1],[3,7,4,8],[2,7,2,9],[6,7,6,8],[6,5,6,6],[6,3,6,4],[13,9,13,10],[13,7,13,8],[13,5,13,6],[13,3,13,4],[12,9,12,10],[12,7,12,8],[12,5,12,6],[12,3,12,4],[11,9,11,10],[11,7,11,8],[11,5,11,6],[11,3,11,4],[10,7,10,8],[10,9,10,10],[5,3,5,10],[9,9,9,10],[9,7,9,8],[9,5,9,6],[26,12,26,17],[39,12,39,17],[45,12,45,17],[1,1,1,10],[17,8,18,10],[17,5,18,7],[17,2,18,4],[31,1,31,10],[2,4,4,6],[29,8,30,10],[29,5,30,7],[29,2,30,4],[27,8,28,10],[27,5,28,7],[27,2,28,4],[25,8,26,10],[25,5,26,7],[25,2,26,4],[23,8,24,10],[14,3,14,10],[15,1,16,10],[2,2,4,3],[19,8,20,10],[19,5,20,7],[19,2,20,4],[40,8,41,10],[40,5,41,7],[40,2,41,4],[38,8,39,10],[38,5,39,7],[38,2,39,4],[36,8,37,10],[36,5,37,7],[36,2,37,4],[34,8,35,10],[34,5,35,7],[34,2,35,4],[32,8,33,10],[23,5,24,7],[23,2,24,4],[21,2,22,4],[21,5,22,7],[21,8,22,10],[57,1,57,4],[56,1,56,4],[55,1,55,4],[54,1,54,4],[52,1,52,4],[53,1,53,4],[32,5,33,7],[32,2,33,4],[43,4,43,5],[43,6,43,9],[51,1,51,4],[48,1,48,4],[49,1,49,4],[50,1,50,4],[47,1,47,4],[58,1,58,4],[69,1,69,4],[68,1,68,4],[67,1,67,4],[66,1,66,4],[65,1,65,4],[64,1,64,4],[63,1,63,4],[62,1,62,4],[61,1,61,4],[60,1,60,4],[59,1,59,4]]}
[]
[null,"Rozdelenie",null,null,null,null,null,null,null,null,null,null,"tu napíš ABC"]
[null,"Dátum:",{"$f":"TODAY()","v":"2016-01-01"},null,null,null,null,"zmena:",null,null,{"$f":"CHOOSE(VLOOKUP($M$3,$O$3:$P$5,2,FALSE),A!K3,B!K3,'C'!K3:K7)","v":"B"},null,"b",null,"A",1]
[null,null,null,null,null,null,null,"Stav družstva",null,"celkový:",{"$f":"CHOOSE(VLOOKUP($M$3,$O$3:$P$5,2,FALSE),A!K4,B!K4,'C'!K4:K8)","v":13},null,null,null,"B",2]
[null,null,null,null,null,null,null,null,null,"skutočný:",{"$f":"CHOOSE(VLOOKUP($M$3,$O$3:$P$5,2,FALSE),A!K5,B!K5,'C'!K5:K9)","v":12},null,null,null,"C",3]
[null,"Poznámka:"]
[null,"Spojovacia služba:",null,{"$f":"CHOOSE(VLOOKUP($M$3,$O$3:$P$5,2,FALSE),A!D7,B!D7,'C'!D7:D11)","v":"n"},{"$f":"CHOOSE(VLOOKUP($M$3,$O$3:$P$5,2,FALSE),A!E7,B!E7,'C'!E7:E11)","v":0},{"$f":"CHOOSE(VLOOKUP($M$3,$O$3:$P$5,2,FALSE),A!F7,B!F7,'C'!F7:F11)","v":0},{"$f":"CHOOSE(VLOOKUP($M$3,$O$3:$P$5,2,FALSE),A!G7,B!G7,'C'!G7:G11)","v":0},{"$f":"CHOOSE(VLOOKUP($M$3,$O$3:$P$5,2,FALSE),A!H7,B!H7,'C'!H7:H11)","v":0},{"$f":"CHOOSE(VLOOKUP($M$3,$O$3:$P$5,2,FALSE),A!I7,B!I7,'C'!I7:I11)","v":0},{"$f":"CHOOSE(VLOOKUP($M$3,$O$3:$P$5,2,FALSE),A!J7,B!J7,'C'!J7:J11)","v":0},{"$f":"CHOOSE(VLOOKUP($M$3,$O$3:$P$5,2,FALSE),A!K7,B!K7,'C'!K7:K11)","v":0}]
[null,"Dovolenka:",null,{"$f":"CHOOSE(VLOOKUP($M$3,$O$3:$P$5,2,FALSE),A!D8,B!D8,'C'!D8:D12)","v":0},{"$f":"CHOOSE(VLOOKUP($M$3,$O$3:$P$5,2,FALSE),A!E8,B!E8,'C'!E8:E12)","v":0},{"$f":"CHOOSE(VLOOKUP($M$3,$O$3:$P$5,2,FALSE),A!F8,B!F8,'C'!F8:F12)","v":0},{"$f":"CHOOSE(VLOOKUP($M$3,$O$3:$P$5,2,FALSE),A!G8,B!G8,'C'!G8:G12)","v":0},{"$f":"CHOOSE(VLOOKUP($M$3,$O$3:$P$5,2,FALSE),A!H8,B!H8,'C'!H8:H12)","v":0},{"$f":"CHOOSE(VLOOKUP($M$3,$O$3:$P$5,2,FALSE),A!I8,B!I8,'C'!I8:I12)","v":0},{"$f":"CHOOSE(VLOOKUP($M$3,$O$3:$P$5,2,FALSE),A!J8,B!J8,'C'!J8:J12)","v":0},{"$f":"CHOOSE(VLOOKUP($M$3,$O$3:$P$5,2,FALSE),A!K8,B!K8,'C'!K8:K12)","v":0}]
[null,"PN (OČR):",null,{"$f":"CHOOSE(VLOOKUP($M$3,$O$3:$P$5,2,FALSE),A!D9,B!D9,'C'!D9:D13)","v":0},{"$f":"CHOOSE(VLOOKUP($M$3,$O$3:$P$5,2,FALSE),A!E9,B!E9,'C'!E9:E13)","v":0},{"$f":"CHOOSE(VLOOKUP($M$3,$O$3:$P$5,2,FALSE),A!F9,B!F9,'C'!F9:F13)","v":0},{"$f":"CHOOSE(VLOOKUP($M$3,$O$3:$P$5,2,FALSE),A!G9,B!G9,'C'!G9:G13)","v":0},{"$f":"CHOOSE(VLOOKUP($M$3,$O$3:$P$5,2,FALSE),A!H9,B!H9,'C'!H9:H13)","v":0},{"$f":"CHOOSE(VLOOKUP($M$3,$O$3:$P$5,2,FALSE),A!I9,B!I9,'C'!I9:I13)","v":0},{"$f":"CHOOSE(VLOOKUP($M$3,$O$3:$P$5,2,FALSE),A!J9,B!J9,'C'!J9:J13)","v":0},{"$f":"CHOOSE(VLOOKUP($M$3,$O$3:$P$5,2,FALSE),A!K9,B!K9,'C'!K9:K13)","v":0}]
[null,"Odvelený:",null,{"$f":"CHOOSE(VLOOKUP($M$3,$O$3:$P$5,2,FALSE),A!D10,B!D10,'C'!D10:D14)","v":0},{"$f":"CHOOSE(VLOOKUP($M$3,$O$3:$P$5,2,FALSE),A!E10,B!E10,'C'!E10:E14)","v":0},{"$f":"CHOOSE(VLOOKUP($M$3,$O$3:$P$5,2,FALSE),A!F10,B!F10,'C'!F10:F14)","v":0},{"$f":"CHOOSE(VLOOKUP($M$3,$O$3:$P$5,2,FALSE),A!G10,B!G10,'C'!G10:G14)","v":0},{"$f":"CHOOSE(VLOOKUP($M$3,$O$3:$P$5,2,FALSE),A!H10,B!H10,'C'!H10:H14)","v":0},{"$f":"CHOOSE(VLOOKUP($M$3,$O$3:$P$5,2,FALSE),A!I10,B!I10,'C'!I10:I14)","v":0},{"$f":"CHOOSE(VLOOKUP($M$3,$O$3:$P$5,2,FALSE),A!J10,B!J10,'C'!J10:J14)","v":0},{"$f":"CHOOSE(VLOOKUP($M$3,$O$3:$P$5,2,FALSE),A!K10,B!K10,'C'!K10:K14)","v":0}]
[null,"Školenie:",null,{"$f":"CHOOSE(VLOOKUP($M$3,$O$3:$P$5,2,FALSE),A!D11,B!D11,'C'!D11:D15)","v":0},{"$f":"CHOOSE(VLOOKUP($M$3,$O$3:$P$5,2,FALSE),A!E11,B!E11,'C'!E11:E15)","v":0},{"$f":"CHOOSE(VLOOKUP($M$3,$O$3:$P$5,2,FALSE),A!F11,B!F11,'C'!F11:F15)","v":0},{"$f":"CHOOSE(VLOOKUP($M$3,$O$3:$P$5,2,FALSE),A!G11,B!G11,'C'!G11:G15)","v":0},{"$f":"CHOOSE(VLOOKUP($M$3,$O$3:$P$5,2,FALSE),A!H11,B!H11,'C'!H11:H15)","v":0},{"$f":"CHOOSE(VLOOKUP($M$3,$O$3:$P$5,2,FALSE),A!I11,B!I11,'C'!I11:I15)","v":0},{"$f":"CHOOSE(VLOOKUP($M$3,$O$3:$P$5,2,FALSE),A!J11,B!J11,'C'!J11:J15)","v":0},{"$f":"CHOOSE(VLOOKUP($M$3,$O$3:$P$5,2,FALSE),A!K11,B!K11,'C'!K11:K15)","v":0}]
[null,"NV:",null,{"$f":"CHOOSE(VLOOKUP($M$3,$O$3:$P$5,2,FALSE),A!D12,B!D12,'C'!D12:D16)","v":0},{"$f":"CHOOSE(VLOOKUP($M$3,$O$3:$P$5,2,FALSE),A!E12,B!E12,'C'!E12:E16)","v":0},{"$f":"CHOOSE(VLOOKUP($M$3,$O$3:$P$5,2,FALSE),A!F12,B!F12,'C'!F12:F16)","v":0},{"$f":"CHOOSE(VLOOKUP($M$3,$O$3:$P$5,2,FALSE),A!G12,B!G12,'C'!G12:G16)","v":0},{"$f":"CHOOSE(VLOOKUP($M$3,$O$3:$P$5,2,FALSE),A!H12,B!H12,'C'!H12:H16)","v":0},{"$f":"CHOOSE(VLOOKUP($M$3,$O$3:$P$5,2,FALSE),A!I12,B!I12,'C'!I12:I16)","v":0},{"$f":"CHOOSE(VLOOKUP($M$3,$O$3:$P$5,2,FALSE),A!J12,B!J12,'C'!J12:J16)","v":0},{"$f":"CHOOSE(VLOOKUP($M$3,$O$3:$P$5,2,FALSE),A!K12,B!K12,'C'!K12:K16)","v":0}]
[null,"VSČ:",null,{"$f":"CHOOSE(VLOOKUP($M$3,$O$3:$P$5,2,FALSE),A!D13,B!D13,'C'!D13:D17)","v":0},{"$f":"CHOOSE(VLOOKUP($M$3,$O$3:$P$5,2,FALSE),A!E13,B!E13,'C'!E13:E17)","v":0},{"$f":"CHOOSE(VLOOKUP($M$3,$O$3:$P$5,2,FALSE),A!F13,B!F13,'C'!F13:F17)","v":0},{"$f":"CHOOSE(VLOOKUP($M$3,$O$3:$P$5,2,FALSE),A!G13,B!G13,'C'!G13:G17)","v":0},{"$f":"CHOOSE(VLOOKUP($M$3,$O$3:$P$5,2,FALSE),A!H13,B!H13,'C'!H13:H17)","v":0},{"$f":"CHOOSE(VLOOKUP($M$3,$O$3:$P$5,2,FALSE),A!I13,B!I13,'C'!I13:I17)","v":0},{"$f":"CHOOSE(VLOOKUP($M$3,$O$3:$P$5,2,FALSE),A!J13,B!J13,'C'!J13:J17)","v":0},{"$f":"CHOOSE(VLOOKUP($M$3,$O$3:$P$5,2,FALSE),A!K13,B!K13,'C'!K13:K17)","v":0}]
[null,"Pohotovosť:",null,{"$f":"CHOOSE(VLOOKUP($M$3,$O$3:$P$5,2,FALSE),A!D14,B!D14,'C'!D14:D18)","v":0},{"$f":"CHOOSE(VLOOKUP($M$3,$O$3:$P$5,2,FALSE),A!E14,B!E14,'C'!E14:E18)","v":0},{"$f":"CHOOSE(VLOOKUP($M$3,$O$3:$P$5,2,FALSE),A!F14,B!F14,'C'!F14:F18)","v":0},{"$f":"CHOOSE(VLOOKUP($M$3,$O$3:$P$5,2,FALSE),A!G14,B!G14,'C'!G14:G18)","v":0},{"$f":"CHOOSE(VLOOKUP($M$3,$O$3:$P$5,2,FALSE),A!H14,B!H14,'C'!H14:H18)","v":0},{"$f":"CHOOSE(VLOOKUP($M$3,$O$3:$P$5,2,FALSE),A!I14,B!I14,'C'!I14:I18)","v":0},{"$f":"CHOOSE(VLOOKUP($M$3,$O$3:$P$5,2,FALSE),A!J14,B!J14,'C'!J14:J18)","v":0},{"$f":"CHOOSE(VLOOKUP($M$3,$O$3:$P$5,2,FALSE),A!K14,B!K14,'C'!K14:K18)","v":0}]
[null,"iné:",null,{"$f":"CHOOSE(VLOOKUP($M$3,$O$3:$P$5,2,FALSE),A!D15,B!D15,'C'!D15:D19)","v":0},{"$f":"CHOOSE(VLOOKUP($M$3,$O$3:$P$5,2,FALSE),A!E15,B!E15,'C'!E15:E19)","v":0},{"$f":"CHOOSE(VLOOKUP($M$3,$O$3:$P$5,2,FALSE),A!F15,B!F15,'C'!F15:F19)","v":0},{"$f":"CHOOSE(VLOOKUP($M$3,$O$3:$P$5,2,FALSE),A!G15,B!G15,'C'!G15:G19)","v":0},{"$f":"CHOOSE(VLOOKUP($M$3,$O$3:$P$5,2,FALSE),A!H15,B!H15,'C'!H15:H19)","v":0},{"$f":"CHOOSE(VLOOKUP($M$3,$O$3:$P$5,2,FALSE),A!I15,B!I15,'C'!I15:I19)","v":0},{"$f":"CHOOSE(VLOOKUP($M$3,$O$3:$P$5,2,FALSE),A!J15,B!J15,'C'!J15:J19)","v":0},{"$f":"CHOOSE(VLOOKUP($M$3,$O$3:$P$5,2,FALSE),A!K15,B!K15,'C'!K15:K19)","v":0}]
[null,"                      Obsadenie vozidiel:"]
[]
[null,"Vozidlo:",{"$f":"CHOOSE(VLOOKUP($M$3,$O$3:$P$5,2,FALSE),A!C18,B!C18,'C'!C18:C22)","v":1},{"$f":"CHOOSE(VLOOKUP($M$3,$O$3:$P$5,2,FALSE),A!D18,B!D18,'C'!D18:D22)","v":0},{"$f":"CHOOSE(VLOOKUP($M$3,$O$3:$P$5,2,FALSE),A!E18,B!E18,'C'!E18:E22)","v":0},{"$f":"CHOOSE(VLOOKUP($M$3,$O$3:$P$5,2,FALSE),A!F18,B!F18,'C'!F18:F22)","v":2},{"$f":"CHOOSE(VLOOKUP($M$3,$O$3:$P$5,2,FALSE),A!G18,B!G18,'C'!G18:G22)","v":0},{"$f":"CHOOSE(VLOOKUP($M$3,$O$3:$P$5,2,FALSE),A!H18,B!H18,'C'!H18:H22)","v":0},{"$f":"CHOOSE(VLOOKUP($M$3,$O$3:$P$5,2,FALSE),A!I18,B!I18,'C'!I18:I22)","v":3},{"$f":"CHOOSE(VLOOKUP($M$3,$O$3:$P$5,2,FALSE),A!J18,B!J18,'C'!J18:J22)","v":0},{"$f":"CHOOSE(VLOOKUP($M$3,$O$3:$P$5,2,FALSE),A!K18,B!K18,'C'!K18:K22)","v":0}]
[null,null,{"$f":"CHOOSE(VLOOKUP($M$3,$O$3:$P$5,2,FALSE),A!C19,B!C19,'C'!C19:C23)","v":0},{"$f":"CHOOSE(VLOOKUP($M$3,$O$3:$P$5,2,FALSE),A!D19,B!D19,'C'!D19:D23)","v":0},{"$f":"CHOOSE(VLOOKUP($M$3,$O$3:$P$5,2,FALSE),A!E19,B!E19,'C'!E19:E23)","v":0},{"$f":"CHOOSE(VLOOKUP($M$3,$O$3:$P$5,2,FALSE),A!F19,B!F19,'C'!F19:F23)","v":0},{"$f":"CHOOSE(VLOOKUP($M$3,$O$3:$P$5,2,FALSE),A!G19,B!G19,'C'!G19:G23)","v":0},{"$f":"CHOOSE(VLOOKUP($M$3,$O$3:$P$5,2,FALSE),A!H19,B!H19,'C'!H19:H23)","v":0},{"$f":"CHOOSE(VLOOKUP($M$3,$O$3:$P$5,2,FALSE),A!I19,B!I19,'C'!I19:I23)","v":0},{"$f":"CHOOSE(VLOOKUP($M$3,$O$3:$P$5,2,FALSE),A!J19,B!J19,'C'!J19:J23)","v":0},{"$f":"CHOOSE(VLOOKUP($M$3,$O$3:$P$5,2,FALSE),A!K19,B!K19,'C'!K19:K23)","v":0}]
[null,"Veliteľ:",{"$f":"CHOOSE(VLOOKUP($M$3,$O$3:$P$5,2,FALSE),A!C20,B!C20,'C'!C20:C24)","v":"H"},{"$f":"CHOOSE(VLOOKUP($M$3,$O$3:$P$5,2,FALSE),A!D20,B!D20,'C'!D20:D24)","v":0},{"$f":"CHOOSE(VLOOKUP($M$3,$O$3:$P$5,2,FALSE),A!E20,B!E20,'C'!E20:E24)","v":0},{"$f":"CHOOSE(VLOOKUP($M$3,$O$3:$P$5,2,FALSE),A!F20,B!F20,'C'!F20:F24)","v":"I"},{"$f":"CHOOSE(VLOOKUP($M$3,$O$3:$P$5,2,FALSE),A!G20,B!G20,'C'!G20:G24)","v":0},{"$f":"CHOOSE(VLOOKUP($M$3,$O$3:$P$5,2,FALSE),A!H20,B!H20,'C'!H20:H24)","v":0},{"$f":"CHOOSE(VLOOKUP($M$3,$O$3:$P$5,2,FALSE),A!I20,B!I20,'C'!I20:I24)","v":"-"},{"$f":"CHOOSE(VLOOKUP($M$3,$O$3:$P$5,2,FALSE),A!J20,B!J20,'C'!J20:J24)","v":0},{"$f":"CHOOSE(VLOOKUP($M$3,$O$3:$P$5,2,FALSE),A!K20,B!K20,'C'!K20:K24)","v":0}]
[null,null,{"$f":"CHOOSE(VLOOKUP($M$3,$O$3:$P$5,2,FALSE),A!C21,B!C21,'C'!C21:C25)","v":0},{"$f":"CHOOSE(VLOOKUP($M$3,$O$3:$P$5,2,FALSE),A!D21,B!D21,'C'!D21:D25)","v":0},{"$f":"CHOOSE(VLOOKUP($M$3,$O$3:$P$5,2,FALSE),A!E21,B!E21,'C'!E21:E25)","v":0},{"$f":"CHOOSE(VLOOKUP($M$3,$O$3:$P$5,2,FALSE),A!F21,B!F21,'C'!F21:F25)","v":0},{"$f":"CHOOSE(VLOOKUP($M$3,$O$3:$P$5,2,FALSE),A!G21,B!G21,'C'!G21:G25)","v":0},{"$f":"CHOOSE(VLOOKUP($M$3,$O$3:$P$5,2,FALSE),A!H21,B!H21,'C'!H21:H25)","v":0},{"$f":"CHOOSE(VLOOKUP($M$3,$O$3:$P$5,2,FALSE),A!I21,B!I21,'C'!I21:I25)","v":0},{"$f":"CHOOSE(VLOOKUP($M$3,$O$3:$P$5,2,FALSE),A!J21,B!J21,'C'!J21:J25)","v":0},{"$f":"CHOOSE(VLOOKUP($M$3,$O$3:$P$5,2,FALSE),A!K21,B!K21,'C'!K21:K25)","v":0}]
[null,"Strojník:",{"$f":"CHOOSE(VLOOKUP($M$3,$O$3:$P$5,2,FALSE),A!C22,B!C22,'C'!C22:C26)","v":"J"},{"$f":"CHOOSE(VLOOKUP($M$3,$O$3:$P$5,2,FALSE),A!D22,B!D22,'C'!D22:D26)","v":0},{"$f":"CHOOSE(VLOOKUP($M$3,$O$3:$P$5,2,FALSE),A!E22,B!E22,'C'!E22:E26)","v":0},{"$f":"CHOOSE(VLOOKUP($M$3,$O$3:$P$5,2,FALSE),A!F22,B!F22,'C'!F22:F26)","v":"K"},{"$f":"CHOOSE(VLOOKUP($M$3,$O$3:$P$5,2,FALSE),A!G22,B!G22,'C'!G22:G26)","v":0},{"$f":"CHOOSE(VLOOKUP($M$3,$O$3:$P$5,2,FALSE),A!H22,B!H22,'C'!H22:H26)","v":0},{"$f":"CHOOSE(VLOOKUP($M$3,$O$3:$P$5,2,FALSE),A!I22,B!I22,'C'!I22:I26)","v":"-"},{"$f":"CHOOSE(VLOOKUP($M$3,$O$3:$P$5,2,FALSE),A!J22,B!J22,'C'!J22:J26)","v":0},{"$f":"CHOOSE(VLOOKUP($M$3,$O$3:$P$5,2,FALSE),A!K22,B!K22,'C'!K22:K26)","v":0}]
[null,null,{"$f":"CHOOSE(VLOOKUP($M$3,$O$3:$P$5,2,FALSE),A!C23,B!C23,'C'!C23:C27)","v":0},{"$f":"CHOOSE(VLOOKUP($M$3,$O$3:$P$5,2,FALSE),A!D23,B!D23,'C'!D23:D27)","v":0},{"$f":"CHOOSE(VLOOKUP($M$3,$O$3:$P$5,2,FALSE),A!E23,B!E23,'C'!E23:E27)","v":0},{"$f":"CHOOSE(VLOOKUP($M$3,$O$3:$P$5,2,FALSE),A!F23,B!F23,'C'!F23:F27)","v":0},{"$f":"CHOOSE(VLOOKUP($M$3,$O$3:$P$5,2,FALSE),A!G23,B!G23,'C'!G23:G27)","v":0},{"$f":"CHOOSE(VLOOKUP($M$3,$O$3:$P$5,2,FALSE),A!H23,B!H23,'C'!H23:H27)","v":0},{"$f":"CHOOSE(VLOOKUP($M$3,$O$3:$P$5,2,FALSE),A!I23,B!I23,'C'!I23:I27)","v":0},{"$f":"CHOOSE(VLOOKUP($M$3,$O$3:$P$5,2,FALSE),A!J23,B!J23,'C'!J23:J27)","v":0},{"$f":"CHOOSE(VLOOKUP($M$3,$O$3:$P$5,2,FALSE),A!K23,B!K23,'C'!K23:K27)","v":0}]
[null,"č.1",{"$f":"CHOOSE(VLOOKUP($M$3,$O$3:$P$5,2,FALSE),A!C24,B!C24,'C'!C24:C28)","v":"L"},{"$f":"CHOOSE(VLOOKUP($M$3,$O$3:$P$5,2,FALSE),A!D24,B!D24,'C'!D24:D28)","v":0},{"$f":"CHOOSE(VLOOKUP($M$3,$O$3:$P$5,2,FALSE),A!E24,B!E24,'C'!E24:E28)","v":0},{"$f":"CHOOSE(VLOOKUP($M$3,$O$3:$P$5,2,FALSE),A!F24,B!F24,'C'!F24:F28)","v":"M"},{"$f":"CHOOSE(VLOOKUP($M$3,$O$3:$P$5,2,FALSE),A!G24,B!G24,'C'!G24:G28)","v":0},{"$f":"CHOOSE(VLOOKUP($M$3,$O$3:$P$5,2,FALSE),A!H24,B!H24,'C'!H24:H28)","v":0},{"$f":"CHOOSE(VLOOKUP($M$3,$O$3:$P$5,2,FALSE),A!I24,B!I24,'C'!I24:I28)","v":"-"},{"$f":"CHOOSE(VLOOKUP($M$3,$O$3:$P$5,2,FALSE),A!J24,B!J24,'C'!J24:J28)","v":0},{"$f":"CHOOSE(VLOOKUP($M$3,$O$3:$P$5,2,FALSE),A!K24,B!K24,'C'!K24:K28)","v":0}]
[null,null,{"$f":"CHOOSE(VLOOKUP($M$3,$O$3:$P$5,2,FALSE),A!C25,B!C25,'C'!C25:C29)","v":0},{"$f":"CHOOSE(VLOOKUP($M$3,$O$3:$P$5,2,FALSE),A!D25,B!D25,'C'!D25:D29)","v":0},{"$f":"CHOOSE(VLOOKUP($M$3,$O$3:$P$5,2,FALSE),A!E25,B!E25,'C'!E25:E29)","v":0},{"$f":"CHOOSE(VLOOKUP($M$3,$O$3:$P$5,2,FALSE),A!F25,B!F25,'C'!F25:F29)","v":0},{"$f":"CHOOSE(VLOOKUP($M$3,$O$3:$P$5,2,FALSE),A!G25,B!G25,'C'!G25:G29)","v":0},{"$f":"CHOOSE(VLOOKUP($M$3,$O$3:$P$5,2,FALSE),A!H25,B!H25,'C'!H25:H29)","v":0},{"$f":"CHOOSE(VLOOKUP($M$3,$O$3:$P$5,2,FALSE),A!I25,B!I25,'C'!I25:I29)","v":0},{"$f":"CHOOSE(VLOOKUP($M$3,$O$3:$P$5,2,FALSE),A!J25,B!J25,'C'!J25:J29)","v":0},{"$f":"CHOOSE(VLOOKUP($M$3,$O$3:$P$5,2,FALSE),A!K25,B!K25,'C'!K25:K29)","v":0}]
[null,"č.2",{"$f":"CHOOSE(VLOOKUP($M$3,$O$3:$P$5,2,FALSE),A!C26,B!C26,'C'!C26:C30)","v":"-"},{"$f":"CHOOSE(VLOOKUP($M$3,$O$3:$P$5,2,FALSE),A!D26,B!D26,'C'!D26:D30)","v":0},{"$f":"CHOOSE(VLOOKUP($M$3,$O$3:$P$5,2,FALSE),A!E26,B!E26,'C'!E26:E30)","v":0},{"$f":"CHOOSE(VLOOKUP($M$3,$O$3:$P$5,2,FALSE),A!F26,B!F26,'C'!F26:F30)","v":"-"},{"$f":"CHOOSE(VLOOKUP($M$3,$O$3:$P$5,2,FALSE),A!G26,B!G26,'C'!G26:G30)","v":0},{"$f":"CHOOSE(VLOOKUP($M$3,$O$3:$P$5,2,FALSE),A!H26,B!H26,'C'!H26:H30)","v":0},{"$f":"CHOOSE(VLOOKUP($M$3,$O$3:$P$5,2,FALSE),A!I26,B!I26,'C'!I26:I30)","v":"-"},{"$f":"CHOOSE(VLOOKUP($M$3,$O$3:$P$5,2,FALSE),A!J26,B!J26,'C'!J26:J30)","v":0},{"$f":"CHOOSE(VLOOKUP($M$3,$O$3:$P$5,2,FALSE),A!K26,B!K26,'C'!K26:K30)","v":0}]
[null,null,{"$f":"CHOOSE(VLOOKUP($M$3,$O$3:$P$5,2,FALSE),A!C27,B!C27,'C'!C27:C31)","v":0},{"$f":"CHOOSE(VLOOKUP($M$3,$O$3:$P$5,2,FALSE),A!D27,B!D27,'C'!D27:D31)","v":0},{"$f":"CHOOSE(VLOOKUP($M$3,$O$3:$P$5,2,FALSE),A!E27,B!E27,'C'!E27:E31)","v":0},{"$f":"CHOOSE(VLOOKUP($M$3,$O$3:$P$5,2,FALSE),A!F27,B!F27,'C'!F27:F31)","v":0},{"$f":"CHOOSE(VLOOKUP($M$3,$O$3:$P$5,2,FALSE),A!G27,B!G27,'C'!G27:G31)","v":0},{"$f":"CHOOSE(VLOOKUP($M$3,$O$3:$P$5,2,FALSE),A!H27,B!H27,'C'!H27:H31)","v":0},{"$f":"CHOOSE(VLOOKUP($M$3,$O$3:$P$5,2,FALSE),A!I27,B!I27,'C'!I27:I31)","v":0},{"$f":"CHOOSE(VLOOKUP($M$3,$O$3:$P$5,2,FALSE),A!J27,B!J27,'C'!J27:J31)","v":0},{"$f":"CHOOSE(VLOOKUP($M$3,$O$3:$P$5,2,FALSE),A!K27,B!K27,'C'!K27:K31)","v":0}]
[null,"č.3",{"$f":"CHOOSE(VLOOKUP($M$3,$O$3:$P$5,2,FALSE),A!C28,B!C28,'C'!C28:C32)","v":"-"},{"$f":"CHOOSE(VLOOKUP($M$3,$O$3:$P$5,2,FALSE),A!D28,B!D28,'C'!D28:D32)","v":0},{"$f":"CHOOSE(VLOOKUP($M$3,$O$3:$P$5,2,FALSE),A!E28,B!E28,'C'!E28:E32)","v":0},{"$f":"CHOOSE(VLOOKUP($M$3,$O$3:$P$5,2,FALSE),A!F28,B!F28,'C'!F28:F32)","v":"-"},{"$f":"CHOOSE(VLOOKUP($M$3,$O$3:$P$5,2,FALSE),A!G28,B!G28,'C'!G28:G32)","v":0},{"$f":"CHOOSE(VLOOKUP($M$3,$O$3:$P$5,2,FALSE),A!H28,B!H28,'C'!H28:H32)","v":0},{"$f":"CHOOSE(VLOOKUP($M$3,$O$3:$P$5,2,FALSE),A!I28,B!I28,'C'!I28:I32)","v":"-"},{"$f":"CHOOSE(VLOOKUP($M$3,$O$3:$P$5,2,FALSE),A!J28,B!J28,'C'!J28:J32)","v":0},{"$f":"CHOOSE(VLOOKUP($M$3,$O$3:$P$5,2,FALSE),A!K28,B!K28,'C'!K28:K32)","v":0}]
[null,null,{"$f":"CHOOSE(VLOOKUP($M$3,$O$3:$P$5,2,FALSE),A!C29,B!C29,'C'!C29:C33)","v":0},{"$f":"CHOOSE(VLOOKUP($M$3,$O$3:$P$5,2,FALSE),A!D29,B!D29,'C'!D29:D33)","v":0},{"$f":"CHOOSE(VLOOKUP($M$3,$O$3:$P$5,2,FALSE),A!E29,B!E29,'C'!E29:E33)","v":0},{"$f":"CHOOSE(VLOOKUP($M$3,$O$3:$P$5,2,FALSE),A!F29,B!F29,'C'!F29:F33)","v":0},{"$f":"CHOOSE(VLOOKUP($M$3,$O$3:$P$5,2,FALSE),A!G29,B!G29,'C'!G29:G33)","v":0},{"$f":"CHOOSE(VLOOKUP($M$3,$O$3:$P$5,2,FALSE),A!H29,B!H29,'C'!H29:H33)","v":0},{"$f":"CHOOSE(VLOOKUP($M$3,$O$3:$P$5,2,FALSE),A!I29,B!I29,'C'!I29:I33)","v":0},{"$f":"CHOOSE(VLOOKUP($M$3,$O$3:$P$5,2,FALSE),A!J29,B!J29,'C'!J29:J33)","v":0},{"$f":"CHOOSE(VLOOKUP($M$3,$O$3:$P$5,2,FALSE),A!K29,B!K29,'C'!K29:K33)","v":0}]
[null,"č.4",{"$f":"CHOOSE(VLOOKUP($M$3,$O$3:$P$5,2,FALSE),A!C30,B!C30,'C'!C30:C34)","v":"-"},{"$f":"CHOOSE(VLOOKUP($M$3,$O$3:$P$5,2,FALSE),A!D30,B!D30,'C'!D30:D34)","v":0},{"$f":"CHOOSE(VLOOKUP($M$3,$O$3:$P$5,2,FALSE),A!E30,B!E30,'C'!E30:E34)","v":0},{"$f":"CHOOSE(VLOOKUP($M$3,$O$3:$P$5,2,FALSE),A!F30,B!F30,'C'!F30:F34)","v":"-"},{"$f":"CHOOSE(VLOOKUP($M$3,$O$3:$P$5,2,FALSE),A!G30,B!G30,'C'!G30:G34)","v":0},{"$f":"CHOOSE(VLOOKUP($M$3,$O$3:$P$5,2,FALSE),A!H30,B!H30,'C'!H30:H34)","v":0},{"$f":"CHOOSE(VLOOKUP($M$3,$O$3:$P$5,2,FALSE),A!I30,B!I30,'C'!I30:I34)","v":"-"},{"$f":"CHOOSE(VLOOKUP($M$3,$O$3:$P$5,2,FALSE),A!J30,B!J30,'C'!J30:J34)","v":0},{"$f":"CHOOSE(VLOOKUP($M$3,$O$3:$P$5,2,FALSE),A!K30,B!K30,'C'!K30:K34)","v":0}]
[null,null,{"$f":"CHOOSE(VLOOKUP($M$3,$O$3:$P$5,2,FALSE),A!C31,B!C31,'C'!C31:C35)","v":0},{"$f":"CHOOSE(VLOOKUP($M$3,$O$3:$P$5,2,FALSE),A!D31,B!D31,'C'!D31:D35)","v":0},{"$f":"CHOOSE(VLOOKUP($M$3,$O$3:$P$5,2,FALSE),A!E31,B!E31,'C'!E31:E35)","v":0},{"$f":"CHOOSE(VLOOKUP($M$3,$O$3:$P$5,2,FALSE),A!F31,B!F31,'C'!F31:F35)","v":0},{"$f":"CHOOSE(VLOOKUP($M$3,$O$3:$P$5,2,FALSE),A!G31,B!G31,'C'!G31:G35)","v":0},{"$f":"CHOOSE(VLOOKUP($M$3,$O$3:$P$5,2,FALSE),A!H31,B!H31,'C'!H31:H35)","v":0},{"$f":"CHOOSE(VLOOKUP($M$3,$O$3:$P$5,2,FALSE),A!I31,B!I31,'C'!I31:I35)","v":0},{"$f":"CHOOSE(VLOOKUP($M$3,$O$3:$P$5,2,FALSE),A!J31,B!J31,'C'!J31:J35)","v":0},{"$f":"CHOOSE(VLOOKUP($M$3,$O$3:$P$5,2,FALSE),A!K31,B!K31,'C'!K31:K35)","v":0}]
[null,"                      Špeciálna technika:"]
[null,"Vozidlo:",{"$f":"CHOOSE(VLOOKUP($M$3,$O$3:$P$5,2,FALSE),A!C33,B!C33,'C'!C33:C37)","v":4},{"$f":"CHOOSE(VLOOKUP($M$3,$O$3:$P$5,2,FALSE),A!D33,B!D33,'C'!D33:D37)","v":0},{"$f":"CHOOSE(VLOOKUP($M$3,$O$3:$P$5,2,FALSE),A!E33,B!E33,'C'!E33:E37)","v":0},{"$f":"CHOOSE(VLOOKUP($M$3,$O$3:$P$5,2,FALSE),A!F33,B!F33,'C'!F33:F37)","v":5},{"$f":"CHOOSE(VLOOKUP($M$3,$O$3:$P$5,2,FALSE),A!G33,B!G33,'C'!G33:G37)","v":0},{"$f":"CHOOSE(VLOOKUP($M$3,$O$3:$P$5,2,FALSE),A!H33,B!H33,'C'!H33:H37)","v":0},{"$f":"CHOOSE(VLOOKUP($M$3,$O$3:$P$5,2,FALSE),A!I33,B!I33,'C'!I33:I37)","v":6},{"$f":"CHOOSE(VLOOKUP($M$3,$O$3:$P$5,2,FALSE),A!J33,B!J33,'C'!J33:J37)","v":0},{"$f":"CHOOSE(VLOOKUP($M$3,$O$3:$P$5,2,FALSE),A!K33,B!K33,'C'!K33:K37)","v":0}]
[null,null,{"$f":"CHOOSE(VLOOKUP($M$3,$O$3:$P$5,2,FALSE),A!C34,B!C34,'C'!C34:C38)","v":0},{"$f":"CHOOSE(VLOOKUP($M$3,$O$3:$P$5,2,FALSE),A!D34,B!D34,'C'!D34:D38)","v":0},{"$f":"CHOOSE(VLOOKUP($M$3,$O$3:$P$5,2,FALSE),A!E34,B!E34,'C'!E34:E38)","v":0},{"$f":"CHOOSE(VLOOKUP($M$3,$O$3:$P$5,2,FALSE),A!F34,B!F34,'C'!F34:F38)","v":0},{"$f":"CHOOSE(VLOOKUP($M$3,$O$3:$P$5,2,FALSE),A!G34,B!G34,'C'!G34:G38)","v":0},{"$f":"CHOOSE(VLOOKUP($M$3,$O$3:$P$5,2,FALSE),A!H34,B!H34,'C'!H34:H38)","v":0},{"$f":"CHOOSE(VLOOKUP($M$3,$O$3:$P$5,2,FALSE),A!I34,B!I34,'C'!I34:I38)","v":0},{"$f":"CHOOSE(VLOOKUP($M$3,$O$3:$P$5,2,FALSE),A!J34,B!J34,'C'!J34:J38)","v":0},{"$f":"CHOOSE(VLOOKUP($M$3,$O$3:$P$5,2,FALSE),A!K34,B!K34,'C'!K34:K38)","v":0}]
[null,"Veliteľ:",{"$f":"CHOOSE(VLOOKUP($M$3,$O$3:$P$5,2,FALSE),A!C35,B!C35,'C'!C35:C39)","v":"-"},{"$f":"CHOOSE(VLOOKUP($M$3,$O$3:$P$5,2,FALSE),A!D35,B!D35,'C'!D35:D39)","v":0},{"$f":"CHOOSE(VLOOKUP($M$3,$O$3:$P$5,2,FALSE),A!E35,B!E35,'C'!E35:E39)","v":0},{"$f":"CHOOSE(VLOOKUP($M$3,$O$3:$P$5,2,FALSE),A!F35,B!F35,'C'!F35:F39)","v":"-"},{"$f":"CHOOSE(VLOOKUP($M$3,$O$3:$P$5,2,FALSE),A!G35,B!G35,'C'!G35:G39)","v":0},{"$f":"CHOOSE(VLOOKUP($M$3,$O$3:$P$5,2,FALSE),A!H35,B!H35,'C'!H35:H39)","v":0},{"$f":"CHOOSE(VLOOKUP($M$3,$O$3:$P$5,2,FALSE),A!I35,B!I35,'C'!I35:I39)","v":"-"},{"$f":"CHOOSE(VLOOKUP($M$3,$O$3:$P$5,2,FALSE),A!J35,B!J35,'C'!J35:J39)","v":0},{"$f":"CHOOSE(VLOOKUP($M$3,$O$3:$P$5,2,FALSE),A!K35,B!K35,'C'!K35:K39)","v":0}]
[null,null,{"$f":"CHOOSE(VLOOKUP($M$3,$O$3:$P$5,2,FALSE),A!C36,B!C36,'C'!C36:C40)","v":0},{"$f":"CHOOSE(VLOOKUP($M$3,$O$3:$P$5,2,FALSE),A!D36,B!D36,'C'!D36:D40)","v":0},{"$f":"CHOOSE(VLOOKUP($M$3,$O$3:$P$5,2,FALSE),A!E36,B!E36,'C'!E36:E40)","v":0},{"$f":"CHOOSE(VLOOKUP($M$3,$O$3:$P$5,2,FALSE),A!F36,B!F36,'C'!F36:F40)","v":0},{"$f":"CHOOSE(VLOOKUP($M$3,$O$3:$P$5,2,FALSE),A!G36,B!G36,'C'!G36:G40)","v":0},{"$f":"CHOOSE(VLOOKUP($M$3,$O$3:$P$5,2,FALSE),A!H36,B!H36,'C'!H36:H40)","v":0},{"$f":"CHOOSE(VLOOKUP($M$3,$O$3:$P$5,2,FALSE),A!I36,B!I36,'C'!I36:I40)","v":0},{"$f":"CHOOSE(VLOOKUP($M$3,$O$3:$P$5,2,FALSE),A!J36,B!J36,'C'!J36:J40)","v":0},{"$f":"CHOOSE(VLOOKUP($M$3,$O$3:$P$5,2,FALSE),A!K36,B!K36,'C'!K36:K40)","v":0}]
[null,"Strojník:",{"$f":"CHOOSE(VLOOKUP($M$3,$O$3:$P$5,2,FALSE),A!C37,B!C37,'C'!C37:C41)","v":"-"},{"$f":"CHOOSE(VLOOKUP($M$3,$O$3:$P$5,2,FALSE),A!D37,B!D37,'C'!D37:D41)","v":0},{"$f":"CHOOSE(VLOOKUP($M$3,$O$3:$P$5,2,FALSE),A!E37,B!E37,'C'!E37:E41)","v":0},{"$f":"CHOOSE(VLOOKUP($M$3,$O$3:$P$5,2,FALSE),A!F37,B!F37,'C'!F37:F41)","v":"-"},{"$f":"CHOOSE(VLOOKUP($M$3,$O$3:$P$5,2,FALSE),A!G37,B!G37,'C'!G37:G41)","v":0},{"$f":"CHOOSE(VLOOKUP($M$3,$O$3:$P$5,2,FALSE),A!H37,B!H37,'C'!H37:H41)","v":0},{"$f":"CHOOSE(VLOOKUP($M$3,$O$3:$P$5,2,FALSE),A!I37,B!I37,'C'!I37:I41)","v":"-"},{"$f":"CHOOSE(VLOOKUP($M$3,$O$3:$P$5,2,FALSE),A!J37,B!J37,'C'!J37:J41)","v":0},{"$f":"CHOOSE(VLOOKUP($M$3,$O$3:$P$5,2,FALSE),A!K37,B!K37,'C'!K37:K41)","v":0}]
[null,null,{"$f":"CHOOSE(VLOOKUP($M$3,$O$3:$P$5,2,FALSE),A!C38,B!C38,'C'!C38:C42)","v":0},{"$f":"CHOOSE(VLOOKUP($M$3,$O$3:$P$5,2,FALSE),A!D38,B!D38,'C'!D38:D42)","v":0},{"$f":"CHOOSE(VLOOKUP($M$3,$O$3:$P$5,2,FALSE),A!E38,B!E38,'C'!E38:E42)","v":0},{"$f":"CHOOSE(VLOOKUP($M$3,$O$3:$P$5,2,FALSE),A!F38,B!F38,'C'!F38:F42)","v":0},{"$f":"CHOOSE(VLOOKUP($M$3,$O$3:$P$5,2,FALSE),A!G38,B!G38,'C'!G38:G42)","v":0},{"$f":"CHOOSE(VLOOKUP($M$3,$O$3:$P$5,2,FALSE),A!H38,B!H38,'C'!H38:H42)","v":0},{"$f":"CHOOSE(VLOOKUP($M$3,$O$3:$P$5,2,FALSE),A!I38,B!I38,'C'!I38:I42)","v":0},{"$f":"CHOOSE(VLOOKUP($M$3,$O$3:$P$5,2,FALSE),A!J38,B!J38,'C'!J38:J42)","v":0},{"$f":"CHOOSE(VLOOKUP($M$3,$O$3:$P$5,2,FALSE),A!K38,B!K38,'C'!K38:K42)","v":0}]
[null,"č.1",{"$f":"CHOOSE(VLOOKUP($M$3,$O$3:$P$5,2,FALSE),A!C39,B!C39,'C'!C39:C43)","v":"-"},{"$f":"CHOOSE(VLOOKUP($M$3,$O$3:$P$5,2,FALSE),A!D39,B!D39,'C'!D39:D43)","v":0},{"$f":"CHOOSE(VLOOKUP($M$3,$O$3:$P$5,2,FALSE),A!E39,B!E39,'C'!E39:E43)","v":0},{"$f":"CHOOSE(VLOOKUP($M$3,$O$3:$P$5,2,FALSE),A!F39,B!F39,'C'!F39:F43)","v":"-"},{"$f":"CHOOSE(VLOOKUP($M$3,$O$3:$P$5,2,FALSE),A!G39,B!G39,'C'!G39:G43)","v":0},{"$f":"CHOOSE(VLOOKUP($M$3,$O$3:$P$5,2,FALSE),A!H39,B!H39,'C'!H39:H43)","v":0},{"$f":"CHOOSE(VLOOKUP($M$3,$O$3:$P$5,2,FALSE),A!I39,B!I39,'C'!I39:I43)","v":"-"},{"$f":"CHOOSE(VLOOKUP($M$3,$O$3:$P$5,2,FALSE),A!J39,B!J39,'C'!J39:J43)","v":0},{"$f":"CHOOSE(VLOOKUP($M$3,$O$3:$P$5,2,FALSE),A!K39,B!K39,'C'!K39:K43)","v":0}]
[null,null,{"$f":"CHOOSE(VLOOKUP($M$3,$O$3:$P$5,2,FALSE),A!C40,B!C40,'C'!C40:C44)","v":0},{"$f":"CHOOSE(VLOOKUP($M$3,$O$3:$P$5,2,FALSE),A!D40,B!D40,'C'!D40:D44)","v":0},{"$f":"CHOOSE(VLOOKUP($M$3,$O$3:$P$5,2,FALSE),A!E40,B!E40,'C'!E40:E44)","v":0},{"$f":"CHOOSE(VLOOKUP($M$3,$O$3:$P$5,2,FALSE),A!F40,B!F40,'C'!F40:F44)","v":0},{"$f":"CHOOSE(VLOOKUP($M$3,$O$3:$P$5,2,FALSE),A!G40,B!G40,'C'!G40:G44)","v":0},{"$f":"CHOOSE(VLOOKUP($M$3,$O$3:$P$5,2,FALSE),A!H40,B!H40,'C'!H40:H44)","v":0},{"$f":"CHOOSE(VLOOKUP($M$3,$O$3:$P$5,2,FALSE),A!I40,B!I40,'C'!I40:I44)","v":0},{"$f":"CHOOSE(VLOOKUP($M$3,$O$3:$P$5,2,FALSE),A!J40,B!J40,'C'!J40:J44)","v":0},{"$f":"CHOOSE(VLOOKUP($M$3,$O$3:$P$5,2,FALSE),A!K40,B!K40,'C'!K40:K44)","v":0}]
[null,"č.2",{"$f":"CHOOSE(VLOOKUP($M$3,$O$3:$P$5,2,FALSE),A!C41,B!C41,'C'!C41:C45)","v":"-"},{"$f":"CHOOSE(VLOOKUP($M$3,$O$3:$P$5,2,FALSE),A!D41,B!D41,'C'!D41:D45)","v":0},{"$f":"CHOOSE(VLOOKUP($M$3,$O$3:$P$5,2,FALSE),A!E41,B!E41,'C'!E41:E45)","v":0},{"$f":"CHOOSE(VLOOKUP($M$3,$O$3:$P$5,2,FALSE),A!F41,B!F41,'C'!F41:F45)","v":"-"},{"$f":"CHOOSE(VLOOKUP($M$3,$O$3:$P$5,2,FALSE),A!G41,B!G41,'C'!G41:G45)","v":0},{"$f":"CHOOSE(VLOOKUP($M$3,$O$3:$P$5,2,FALSE),A!H41,B!H41,'C'!H41:H45)","v":0},{"$f":"CHOOSE(VLOOKUP($M$3,$O$3:$P$5,2,FALSE),A!I41,B!I41,'C'!I41:I45)","v":"-"},{"$f":"CHOOSE(VLOOKUP($M$3,$O$3:$P$5,2,FALSE),A!J41,B!J41,'C'!J41:J45)","v":0},{"$f":"CHOOSE(VLOOKUP($M$3,$O$3:$P$5,2,FALSE),A!K41,B!K41,'C'!K41:K45)","v":0}]
[null,null,{"$f":"CHOOSE(VLOOKUP($M$3,$O$3:$P$5,2,FALSE),A!C42,B!C42,'C'!C42:C46)","v":0},{"$f":"CHOOSE(VLOOKUP($M$3,$O$3:$P$5,2,FALSE),A!D42,B!D42,'C'!D42:D46)","v":0},{"$f":"CHOOSE(VLOOKUP($M$3,$O$3:$P$5,2,FALSE),A!E42,B!E42,'C'!E42:E46)","v":0},{"$f":"CHOOSE(VLOOKUP($M$3,$O$3:$P$5,2,FALSE),A!F42,B!F42,'C'!F42:F46)","v":0},{"$f":"CHOOSE(VLOOKUP($M$3,$O$3:$P$5,2,FALSE),A!G42,B!G42,'C'!G42:G46)","v":0},{"$f":"CHOOSE(VLOOKUP($M$3,$O$3:$P$5,2,FALSE),A!H42,B!H42,'C'!H42:H46)","v":0},{"$f":"CHOOSE(VLOOKUP($M$3,$O$3:$P$5,2,FALSE),A!I42,B!I42,'C'!I42:I46)","v":0},{"$f":"CHOOSE(VLOOKUP($M$3,$O$3:$P$5,2,FALSE),A!J42,B!J42,'C'!J42:J46)","v":0},{"$f":"CHOOSE(VLOOKUP($M$3,$O$3:$P$5,2,FALSE),A!K42,B!K42,'C'!K42:K46)","v":0}]
[]
[null,null,null,null,"Zmenil a odoslal:",null,{"$f":"CHOOSE(VLOOKUP($M$3,$O$3:$P$5,2,FALSE),A!G44,B!G44,'C'!G44:G48)","v":"n"},{"$f":"CHOOSE(VLOOKUP($M$3,$O$3:$P$5,2,FALSE),A!H44,B!H44,'C'!H44:H48)","v":0},{"$f":"CHOOSE(VLOOKUP($M$3,$O$3:$P$5,2,FALSE),A!I44,B!I44,'C'!I44:I48)","v":0},{"$f":"CHOOSE(VLOOKUP($M$3,$O$3:$P$5,2,FALSE),A!J44,B!J44,'C'!J44:J48)","v":0}]

{"sheet":"A","index":2,"n_rows":44,"n_cols":11,"rows_kept":44,"cut":false,"hidden":false,"merged":[[5,1,5,2],[5,3,5,10],[6,1,6,2],[6,3,6,4],[6,5,6,6],[6,7,6,8],[6,9,6,10],[1,1,1,10],[2,1,4,1],[2,2,4,3],[2,4,4,6],[2,7,2,9],[3,7,4,8],[7,1,7,2],[7,3,7,4],[7,5,7,6],[7,7,7,8],[7,9,7,10],[8,1,8,2],[8,3,8,4],[8,5,8,6],[8,7,8,8],[8,9,8,10],[9,1,9,2],[9,3,9,4],[9,5,9,6],[9,7,9,8],[9,9,9,10],[10,1,10,2],[10,3,10,4],[10,5,10,6],[10,7,10,8],[10,9,10,10],[13,1,13,2],[13,3,13,4],[13,5,13,6],[13,7,13,8],[13,9,13,10],[14,1,14,2],[14,3,14,10],[11,1,11,2],[11,3,11,4],[11,5,11,6],[11,7,11,8],[11,9,11,10],[12,1,12,2],[12,3,12,4],[12,5,12,6],[12,7,12,8],[12,9,12,10],[21,1,22,1],[21,2,22,4],[21,5,22,7],[21,8,22,10],[23,1,24,1],[23,2,24,4],[23,5,24,7],[23,8,24,10],[15,1,16,10],[17,1,18,1],[17,2,18,4],[17,5,18,7],[17,8,18,10],[19,1,20,1],[19,2,20,4],[19,5,20,7],[19,8,20,10],[25,1,26,1],[25,2,26,4],[25,5,26,7],[25,8,26,10],[26,12,26,17],[27,1,28,1],[27,2,28,4],[27,5,28,7],[27,8,28,10],[34,1,35,1],[34,2,35,4],[34,5,35,7],[34,8,35,10],[36,1,37,1],[36,2,37,4],[36,5,37,7],[36,8,37,10],[29,1,30,1],[29,2,30,4],[29,5,30,7],[29,8,30,10],[31,1,31,10],[32,1,33,1],[32,2,33,4],[32,5,33,7],[32,8,33,10],[38,1,39,1],[38,2,39,4],[38,5,39,7],[38,8,39,10],[39,12,39,17],[40,1,41,1],[40,2,41,4],[40,5,41,7],[40,8,41,10],[50,1,50,4],[51,1,51,4],[52,1,52,4],[53,1,53,4],[54,1,54,4],[55,1,55,4],[43,4,43,5],[43,6,43,9],[45,12,45,17],[47,1,47,4],[48,1,48,4],[49,1,49,4],[68,1,68,4],[69,1,69,4],[62,1,62,4],[63,1,63,4],[64,1,64,4],[65,1,65,4],[66,1,66,4],[67,1,67,4],[56,1,56,4],[57,1,57,4],[58,1,58,4],[59,1,59,4],[60,1,60,4],[61,1,61,4]]}
[]
[null,"Rozdelenie "]
[null,"Dátum:",{"$f":"TODAY()","v":"2016-01-01"},null,null,null,null,"zmena:",null,null,"A"]
[null,null,null,null,null,null,null,"Stav družstva",null,"celkový:",12]
[null,null,null,null,null,null,null,null,null,"skutočný:",8]
[null,"Poznámka:"]
[null,"Spojovacia služba:",null,"d"]
[null,"Dovolenka:"]
[null,"PN (OČR):"]
[null,"Odvelený:"]
[null,"Školenie:"]
[null,"NV:"]
[null,"VSČ:"]
[null,"Pohotovosť:"]
[null,"iné:"]
[null,"                      Obsadenie vozidiel:"]
[]
[null,"Vozidlo:",1,null,null,2,null,null,3]
[]
[null,"Veliteľ:","A",null,null,"B",null,null,"-"]
[]
[null,"Strojník:","C",null,null,"D",null,null,"-"]
[]
[null,"č.1","E",null,null,"F",null,null,"-"]
[]
[null,"č.2","-",null,null,"-",null,null,"-"]
[]
[null,"č.3","-",null,null,"-",null,null,"-"]
[]
[null,"č.4","-",null,null,"-",null,null,"-"]
[]
[null,"                      Špeciálna technika:"]
[null,"Vozidlo:",4,null,null,5,null,null,6]
[]
[null,"Veliteľ:","-",null,null,"-",null,null,"-"]
[]
[null,"Strojník:","-",null,null,"-",null,null,"-"]
[]
[null,"č.1","-",null,null,"-",null,null,"-"]
[]
[null,"č.2","-",null,null,"-",null,null,"-"]
[]
[]
[null,null,null,null,"Zmenil a odoslal:",null,"g"]

{"sheet":"B","index":3,"n_rows":44,"n_cols":11,"rows_kept":44,"cut":false,"hidden":false,"merged":[[5,1,5,2],[5,3,5,10],[6,1,6,2],[6,3,6,4],[6,5,6,6],[6,7,6,8],[6,9,6,10],[1,1,1,10],[1,12,1,17],[2,1,4,1],[2,2,4,3],[2,4,4,6],[2,7,2,9],[2,12,2,17],[3,7,4,8],[7,1,7,2],[7,3,7,4],[7,5,7,6],[7,7,7,8],[7,9,7,10],[8,1,8,2],[8,3,8,4],[8,5,8,6],[8,7,8,8],[8,9,8,10],[9,1,9,2],[9,3,9,4],[9,5,9,6],[9,7,9,8],[9,9,9,10],[10,1,10,2],[10,3,10,4],[10,5,10,6],[10,7,10,8],[10,9,10,10],[13,1,13,2],[13,3,13,4],[13,5,13,6],[13,7,13,8],[13,9,13,10],[14,1,14,2],[14,3,14,10],[11,1,11,2],[11,3,11,4],[11,5,11,6],[11,7,11,8],[11,9,11,10],[12,1,12,2],[12,3,12,4],[12,5,12,6],[12,7,12,8],[12,9,12,10],[21,1,22,1],[21,2,22,4],[21,5,22,7],[21,8,22,10],[23,1,24,1],[23,2,24,4],[23,5,24,7],[23,8,24,10],[15,1,16,10],[17,1,18,1],[17,2,18,4],[17,5,18,7],[17,8,18,10],[19,1,20,1],[19,2,20,4],[19,5,20,7],[19,8,20,10],[25,1,26,1],[25,2,26,4],[25,5,26,7],[25,8,26,10],[26,12,26,17],[27,1,28,1],[27,2,28,4],[27,5,28,7],[27,8,28,10],[34,1,35,1],[34,2,35,4],[34,5,35,7],[34,8,35,10],[36,1,37,1],[36,2,37,4],[36,5,37,7],[36,8,37,10],[29,1,30,1],[29,2,30,4],[29,5,30,7],[29,8,30,10],[31,1,31,10],[32,1,33,1],[32,2,33,4],[32,5,33,7],[32,8,33,10],[38,1,39,1],[38,2,39,4],[38,5,39,7],[38,8,39,10],[39,12,39,17],[40,1,41,1],[40,2,41,4],[40,5,41,7],[40,8,41,10],[50,1,50,4],[51,1,51,4],[52,1,52,4],[53,1,53,4],[54,1,54,4],[55,1,55,4],[43,4,43,5],[43,6,43,9],[45,12,45,17],[47,1,47,4],[48,1,48,4],[49,1,49,4],[68,1,68,4],[69,1,69,4],[62,1,62,4],[63,1,63,4],[64,1,64,4],[65,1,65,4],[66,1,66,4],[67,1,67,4],[56,1,56,4],[57,1,57,4],[58,1,58,4],[59,1,59,4],[60,1,60,4],[61,1,61,4]]}
[]
[null,"Rozdelenie "]
[null,"Dátum:",{"$f":"TODAY()","v":"2016-01-01"},null,null,null,null,"zmena:",null,null,"B"]
[null,null,null,null,null,null,null,"Stav družstva",null,"celkový:",13]
[null,null,null,null,null,null,null,null,null,"skutočný:",12]
[null,"Poznámka:"]
[null,"Spojovacia služba:",null,"n"]
[null,"Dovolenka:"]
[null,"PN (OČR):"]
[null,"Odvelený:"]
[null,"Školenie:"]
[null,"NV:"]
[null,"VSČ:"]
[null,"Pohotovosť:"]
[null,"iné:"]
[null,"                      Obsadenie vozidiel:"]
[]
[null,"Vozidlo:",1,null,null,2,null,null,3]
[]
[null,"Veliteľ:","H",null,null,"I",null,null,"-"]
[]
[null,"Strojník:","J",null,null,"K",null,null,"-"]
[]
[null,"č.1","L",null,null,"M",null,null,"-"]
[]
[null,"č.2","-",null,null,"-",null,null,"-"]
[]
[null,"č.3","-",null,null,"-",null,null,"-"]
[]
[null,"č.4","-",null,null,"-",null,null,"-"]
[]
[null,"                      Špeciálna technika:"]
[null,"Vozidlo:",4,null,null,5,null,null,6]
[]
[null,"Veliteľ:","-",null,null,"-",null,null,"-"]
[]
[null,"Strojník:","-",null,null,"-",null,null,"-"]
[]
[null,"č.1","-",null,null,"-",null,null,"-"]
[]
[null,"č.2","-",null,null,"-",null,null,"-"]
[]
[]
[null,null,null,null,"Zmenil a odoslal:",null,"n"]

{"sheet":"C","index":4,"n_rows":44,"n_cols":11,"rows_kept":44,"cut":false,"hidden":false,"merged":[[5,1,5,2],[5,3,5,10],[6,1,6,2],[6,3,6,4],[6,5,6,6],[6,7,6,8],[6,9,6,10],[1,1,1,10],[1,12,1,17],[2,1,4,1],[2,2,4,3],[2,4,4,6],[2,7,2,9],[2,12,2,17],[3,7,4,8],[7,1,7,2],[7,3,7,4],[7,5,7,6],[7,7,7,8],[7,9,7,10],[8,1,8,2],[8,3,8,4],[8,5,8,6],[8,7,8,8],[8,9,8,10],[9,1,9,2],[9,3,9,4],[9,5,9,6],[9,7,9,8],[9,9,9,10],[10,1,10,2],[10,3,10,4],[10,5,10,6],[10,7,10,8],[10,9,10,10],[13,1,13,2],[13,3,13,4],[13,5,13,6],[13,7,13,8],[13,9,13,10],[14,1,14,2],[14,3,14,10],[11,1,11,2],[11,3,11,4],[11,5,11,6],[11,7,11,8],[11,9,11,10],[12,1,12,2],[12,3,12,4],[12,5,12,6],[12,7,12,8],[12,9,12,10],[21,1,22,1],[21,2,22,4],[21,5,22,7],[21,8,22,10],[23,1,24,1],[23,2,24,4],[23,5,24,7],[23,8,24,10],[15,1,16,10],[17,1,18,1],[17,2,18,4],[17,5,18,7],[17,8,18,10],[19,1,20,1],[19,2,20,4],[19,5,20,7],[19,8,20,10],[25,1,26,1],[25,2,26,4],[25,5,26,7],[25,8,26,10],[26,12,26,17],[27,1,28,1],[27,2,28,4],[27,5,28,7],[27,8,28,10],[34,1,35,1],[34,2,35,4],[34,5,35,7],[34,8,35,10],[36,1,37,1],[36,2,37,4],[36,5,37,7],[36,8,37,10],[29,1,30,1],[29,2,30,4],[29,5,30,7],[29,8,30,10],[31,1,31,10],[32,1,33,1],[32,2,33,4],[32,5,33,7],[32,8,33,10],[38,1,39,1],[38,2,39,4],[38,5,39,7],[38,8,39,10],[39,12,39,17],[40,1,41,1],[40,2,41,4],[40,5,41,7],[40,8,41,10],[50,1,50,4],[51,1,51,4],[52,1,52,4],[53,1,53,4],[54,1,54,4],[55,1,55,4],[43,4,43,5],[43,6,43,9],[45,12,45,17],[47,1,47,4],[48,1,48,4],[49,1,49,4],[68,1,68,4],[69,1,69,4],[62,1,62,4],[63,1,63,4],[64,1,64,4],[65,1,65,4],[66,1,66,4],[67,1,67,4],[56,1,56,4],[57,1,57,4],[58,1,58,4],[59,1,59,4],[60,1,60,4],[61,1,61,4]]}
[]
[null,"Rozdelenie "]
[null,"Dátum:",{"$f":"TODAY()","v":"2016-01-01"},null,null,null,null,"zmena:",null,null,"C"]
[null,null,null,null,null,null,null,"Stav družstva",null,"celkový:",12]
[null,null,null,null,null,null,null,null,null,"skutočný:",8]
[null,"Poznámka:"]
[null,"Spojovacia služba:",null,"v"]
[null,"Dovolenka:"]
[null,"PN (OČR):"]
[null,"Odvelený:"]
[null,"Školenie:"]
[null,"NV:"]
[null,"VSČ:"]
[null,"Pohotovosť:"]
[null,"iné:"]
[null,"                      Obsadenie vozidiel:"]
[]
[null,"Vozidlo:",1,null,null,2,null,null,3]
[]
[null,"Veliteľ:","O",null,null,"P",null,null,"-"]
[]
[null,"Strojník:","R",null,null,"S",null,null,"-"]
[]
[null,"č.1","T",null,null,"U",null,null,"-"]
[]
[null,"č.2","-",null,null,"-",null,null,"-"]
[]
[null,"č.3","-",null,null,"-",null,null,"-"]
[]
[null,"č.4","-",null,null,"-",null,null,"-"]
[]
[null,"                      Špeciálna technika:"]
[null,"Vozidlo:",4,null,null,5,null,null,6]
[]
[null,"Veliteľ:","-",null,null,"-",null,null,"-"]
[]
[null,"Strojník:","-",null,null,"-",null,null,"-"]
[]
[null,"č.1","-",null,null,"-",null,null,"-"]
[]
[null,"č.2","-",null,null,"-",null,null,"-"]
[]
[]
[null,null,null,null,"Zmenil a odoslal:",null,"v"]

{"sheet":"www","index":5,"n_rows":109,"n_cols":7,"rows_kept":109,"cut":false,"hidden":false,"merged":[]}
["fav_j4wjust4web.cz","fav_etrEtřídnice.cz","fav_ssSeznamŠkol.eu","fav_zsZoznamŠkôl.eu","fav_joJaknaOffice.cz","fav_ohOnline hry","Více"]
["fav_knKam-na.cz","fav_sszSpis szkół v PL","fav_peHR magazín","fav_ucCeloživotní učení","Mateřské školky","Zábavný portál","BMI"]
["Mzdová kalkulačka","Výpočet nemocenské","Výpočet mateřské","Kalkulačky","Referáty","SuperMamina"]
["WWW pro Ĺˇkoly"]
["Jak na Office - tutoriály, video návody"]
["Prohlášení serveru | Spolupráce s námi"]
[]
[]
["Word"]
["Excel"]
["PowerPoint"]
["Access"]
["Outlook"]
["ECDL"]
["Poradna Office"]
["MS Word"]
["MS Excel"]
["MS Access"]
["MS Powerpoint"]
["MS Outlook"]
["ECDL"]
["JaknaOffice.cz"]
[]
[]
["Zajímavé"]
["Trička s vlastním potiskem"]
["Vvtipná trička s potiskem - snadně, rychle a zábavně."]
[]
["Střední školy - přehledný seznam všech středních škol v ČR."]
[]
["Online hry - výběr z těch nejlepších online her."]
[]
[]
["Sledujte nás"]
[]
[]
[]
["Nejčtenější"]
["Generování obsahu (49491x)"]
["Funkce KDYŽ (33398x)"]
["Jak na grafy v Excelu (31473x)"]
["Tabulátory a práce s nimi (31126x)"]
["Přehled funkcí v Excelu (30256x)"]
["Vytvoření databáze v MS Access (28187x)"]
["Základy formátování odstavce (25848x)"]
["Pokročilá úprava obrázků (24186x)"]
["Dotazy (23067x)"]
["Funkce v Excelu (21586x)"]
[]
[]
["Diskutuje se"]
["Prenos posledne zadaných údajov"]
["včera v 14.48 - MS Excel"]
["Prenos posledne zadaných údajov"]
["včera v 14.13 - Poradna"]
["Téma: EXCEL - zvacsenie pisma v ponuke OVERENIE UDAJOV"]
["30.12.2015 - Poradna"]
["Vytvoření rozevíracého seznamu s možnostmi použití barev"]
["29.12.2015 - Poradna"]
["Sloučení identických sloupců z více tabulek do kontingenční tabulky."]
["29.12.2015 - MS Excel"]
["Souřadnice hodnoty v tabulce"]
["29.12.2015 - MS Excel"]
["Souřadnice hodnoty v tabulce"]
["29.12.2015 - Poradna"]
["Sloučení identických sloupců z více tabulek do kontingenční tabulky."]
["29.12.2015 - Poradna"]
["Jak na Office - tutoriály, video návody » Fórum » Poradna » MS Excel » Prenos posledne zadaných údajov"]
[]
["Poradna - Prenos posledne zadaných údajov"]
[]
["hlavní kategorie | zpět | + odpovědět na toto téma"]
["Prenos posledne zadaných údajov - diskuze na toto téma"]
["Dobrý deň. Prosím o radu pri nastavení vzorca na zadávanie údajov. Mám 4 hárky: Na všetkých budú identické rozloženie tabuliek 1- hlavný, ktorý bude zamknutý a nebude sa dať upravovať, len odoslať mailom. Na 2, 3, a 4 hárku budú spomínané identické tabuľky,ale s rôznymi údajmi v bunkách, ktoré sa budú vyberať z rozbaľovacieho zoznamu. 1. deň sa zmenia údaje na hárku č. 2 a odošlú sa mailom z hlavného hárka č1 pomocou makra. 2. deň sa zmenia údaje na hárku č. 3 a odošlú sa mailom z hlavného hárka č1. 3. deň sa zmenia údaje na hárku č. 4 a odošlú sa mailom z hlavného hárka č1. a tak stále dookola V skratke: potrebujem aby sa na hárok č.1 preniesli údaje s hárka vyplneného v daný deň."]
[]
["Dušan | 31.12.2015 14:48   "]
["  "]
["  "]
["ešte prikladám súbor"]
[]
["icon Vzor.xlsm"]
["Odpověď"]
["Jak na Office - tutoriály, video návody | Sitemap | RSS rss| Provozovatelem je společnost (© 2016) just4web.cz s.r.o.."]
[]
["just4web.cz s.r.o."]
["Dobrovského 2366"]
["580 01 Havlíčkův Brod"]
["Nejvyhledávanější"]
["Poradna"]
["Word"]
["Excel"]
["Powerpoint"]
["Access"]
["Outlook"]
["ECDL"]
["Naše další projekty"]
["Seznam škol"]
["Zoznam škôl"]
["Spis szkół"]
["Referáty"]
["Kam na výlet"]
["Mzdová kalkulačka"]
["Online hry"]
["just4web.cz s.r.o."]
["Služby"]
["Naše projekty"]
["Reference"]
["Kariéra"]
["O nás"]