{"text_format":"1","workbook":"xlsx","n_sheets":6,"sheets":["SaP","Rozdelenie","A","B","C","www"],"not_rendered":{"charts":0,"images":0,"macros":1,"external_links":0,"defined_names":9,"comments":0,"pivot_tables":0},"unopened":[],"bounds":{"document_bytes":16777216,"sheet_cells":100000,"rows_first":2000,"rows_last":500,"rows_between":2000,"halvings":0,"cell_chars":16384,"cell_head_chars":4096},"cells_cut":0,"cells_raw":0,"read":"whole","date_system":"1900"}

{"sheet":"SaP","index":0,"n_rows":150,"n_cols":11,"rows_kept":150,"cut":false,"hidden":true,"merged":[]}
["príslušník",null,"zmena",null,"počet",null,"príslušník2",null,"stav"]
["A",null,"A",null,4,null,"a",null,"-",null,"-"]
["B",null,"B",null,5,null,"b",null,"OK",null,"Stanica"]
["C",null,"C",null,6,null,"c",null,"Oprava",null,"Mimo"]
["D",null,null,null,7,null,"d",null,"Mimo prevádzky",null,"Servis"]
["E",null,null,null,8,null,"e"]
["F",null,null,null,9,null,"f"]
["G",null,null,null,10,null,"g"]
["-",null,null,null,11,null,"-"]
["-",null,null,null,12,null,"-"]
["-",null,null,null,13,null,"-"]
["-",null,null,null,14,null,"-"]
["-",null,null,null,null,null,"-"]
["-",null,null,null,null,null,"-"]
["-",null,null,null,null,null,"-"]
["H",null,null,null,null,null,"h"]
["I",null,null,null,null,null,"i"]
["J",null,null,null,null,null,"j"]
["K",null,null,null,null,null,"k"]
["L",null,null,null,null,null,"l"]
{"$rows_left_out":131}
{"sheet":"Rozdelenie","index":1,"n_rows":44,"n_cols":16,"rows_kept":44,"cut":false,"hidden":false,"merged":[[5,1,5,2],[6,9,6,10],[10,3,10,4],[10,5,10,6],[34,1,35,1],[36,1,37,1],[38,1,39,1],[40,1,41,1],[23,1,24,1],[25,1,26,1],[27,1,28,1],[29,1,30,1],[32,1,33,1],[17,1,18,1],[19,1,20,1],[21,1,22,1],[6,1,6,2],[7,1,7,2],[8,1,8,2],[9,1,9,2],[10,1,10,2],[11,1,11,2],[12,1,12,2],[13,1,13,2],[14,1,14,2],[9,3,9,4],[8,9,8,10],[8,7,8,8],[8,5,8,6],[8,3,8,4],[7,9,7,10],[7,7,7,8],[7,5,7,6],[7,3,7,4],[2,1,4,1],[3,7,4,8],[2,7,2,9],[6,7,6,8],[6,5,6,6],[6,3,6,4],[13,9,13,10],[13,7,13,8],[13,5,13,6],[13,3,13,4],[12,9,12,10],[12,7,12,8],[12,5,12,6],[12,3,12,4],[11,9,11,10],[11,7,11,8],[11,5,11,6],[11,3,11,4],[10,7,10,8],[10,9,10,10],[5,3,5,10],[9,9,9,10],[9,7,9,8],[9,5,9,6],[26,12,26,17],[39,12,39,17],[45,12,45,17],[1,1,1,10],[17,8,18,10],[17,5,18,7],[17,2,18,4],[31,1,31,10],[2,4,4,6],[29,8,30,10],[29,5,30,7],[29,2,30,4],[27,8,28,10],[27,5,28,7],[27,2,28,4],[25,8,26,10],[25,5,26,7],[25,2,26,4],[23,8,24,10],[14,3,14,10],[15,1,16,10],[2,2,4,3],[19,8,20,10],[19,5,20,7],[19,2,20,4],[40,8,41,10],[40,5,41,7],[40,2,41,4],[38,8,39,10],[38,5,39,7],[38,2,39,4],[36,8,37,10],[36,5,37,7],[36,2,37,4],[34,8,35,10],[34,5,35,7],[34,2,35,4],[32,8,33,10],[23,5,24,7],[23,2,24,4],[21,2,22,4],[21,5,22,7],[21,8,22,10],[57,1,57,4],[56,1,56,4],[55,1,55,4],[54,1,54,4],[52,1,52,4],[53,1,53,4],[32,5,33,7],[32,2,33,4],[43,4,43,5],[43,6,43,9],[51,1,51,4],[48,1,48,4],[49,1,49,4],[50,1,50,4],[47,1,47,4],[58,1,58,4],[69,1,69,4],[68,1,68,4],[67,1,67,4],[66,1,66,4],[65,1,65,4],[64,1,64,4],[63,1,63,4],[62,1,62,4],[61,1,61,4],[60,1,60,4],[59,1,59,4]]}
[]
[null,"Rozdelenie",null,null,null,null,null,null,null,null,null,null,"tu napíš ABC"]
[null,"Dátum:",{"$f":"TODAY()","v":"2016-01-01"},null,null,null,null,"zmena:",null,null,{"$f":"CHOOSE(VLOOKUP($M$3,$O$3:$P$5,2,FALSE),A!K3,B!K3,'C'!K3:K7)","v":"B"},null,"b",null,"A",1]
[null,null,null,null,null,null,null,"Stav družstva",null,"celkový:",{"$f":"CHOOSE(VLOOKUP($M$3,$O$3:$P$5,2,FALSE),A!K4,B!K4,'C'!K4:K8)","v":13},null,null,null,"B",2]
[null,null,null,null,null,null,null,null,null,"skutočný:",{"$f":"CHOOSE(VLOOKUP($M$3,$O$3:$P$5,2,FALSE),A!K5,B!K5,'C'!K5:K9)","v":12},null,null,null,"C",3]
[null,"Poznámka:"]
[null,"Spojovacia služba:",null,{"$f":"CHOOSE(VLOOKUP($M$3,$O$3:$P$5,2,FALSE),A!D7,B!D7,'C'!D7:D11)","v":"n"},{"$f":"CHOOSE(VLOOKUP($M$3,$O$3:$P$5,2,FALSE),A!E7,B!E7,'C'!E7:E11)","v":0},{"$f":"CHOOSE(VLOOKUP($M$3,$O$3:$P$5,2,FALSE),A!F7,B!F7,'C'!F7:F11)","v":0},{"$f":"CHOOSE(VLOOKUP($M$3,$O$3:$P$5,2,FALSE),A!G7,B!G7,'C'!G7:G11)","v":0},{"$f":"CHOOSE(VLOOKUP($M$3,$O$3:$P$5,2,FALSE),A!H7,B!H7,'C'!H7:H11)","v":0},{"$f":"CHOOSE(VLOOKUP($M$3,$O$3:$P$5,2,FALSE),A!I7,B!I7,'C'!I7:I11)","v":0},{"$f":"CHOOSE(VLOOKUP($M$3,$O$3:$P$5,2,FALSE),A!J7,B!J7,'C'!J7:J11)","v":0},{"$f":"CHOOSE(VLOOKUP($M$3,$O$3:$P$5,2,FALSE),A!K7,B!K7,'C'!K7:K11)","v":0}]
[null,"Dovolenka:",null,{"$f":"CHOOSE(VLOOKUP($M$3,$O$3:$P$5,2,FALSE),A!D8,B!D8,'C'!D8:D12)","v":0},{"$f":"CHOOSE(VLOOKUP($M$3,$O$3:$P$5,2,FALSE),A!E8,B!E8,'C'!E8:E12)","v":0},{"$f":"CHOOSE(VLOOKUP($M$3,$O$3:$P$5,2,FALSE),A!F8,B!F8,'C'!F8:F12)","v":0},{"$f":"CHOOSE(VLOOKUP($M$3,$O$3:$P$5,2,FALSE),A!G8,B!G8,'C'!G8:G12)","v":0},{"$f":"CHOOSE(VLOOKUP($M$3,$O$3:$P$5,2,FALSE),A!H8,B!H8,'C'!H8:H12)","v":0},{"$f":"CHOOSE(VLOOKUP($M$3,$O$3:$P$5,2,FALSE),A!I8,B!I8,'C'!I8:I12)","v":0},{"$f":"CHOOSE(VLOOKUP($M$3,$O$3:$P$5,2,FALSE),A!J8,B!J8,'C'!J8:J12)","v":0},{"$f":"CHOOSE(VLOOKUP($M$3,$O$3:$P$5,2,FALSE),A!K8,B!K8,'C'!K8:K12)","v":0}]
[null,"PN (OČR):",null,{"$f":"CHOOSE(VLOOKUP($M$3,$O$3:$P$5,2,FALSE),A!D9,B!D9,'C'!D9:D13)","v":0},{"$f":"CHOOSE(VLOOKUP($M$3,$O$3:$P$5,2,FALSE),A!E9,B!E9,'C'!E9:E13)","v":0},{"$f":"CHOOSE(VLOOKUP($M$3,$O$3:$P$5,2,FALSE),A!F9,B!F9,'C'!F9:F13)","v":0},{"$f":"CHOOSE(VLOOKUP($M$3,$O$3:$P$5,2,FALSE),A!G9,B!G9,'C'!G9:G13)","v":0},{"$f":"CHOOSE(VLOOKUP($M$3,$O$3:$P$5,2,FALSE),A!H9,B!H9,'C'!H9:H13)","v":0},{"$f":"CHOOSE(VLOOKUP($M$3,$O$3:$P$5,2,FALSE),A!I9,B!I9,'C'!I9:I13)","v":0},{"$f":"CHOOSE(VLOOKUP($M$3,$O$3:$P$5,2,FALSE),A!J9,B!J9,'C'!J9:J13)","v":0},{"$f":"CHOOSE(VLOOKUP($M$3,$O$3:$P$5,2,FALSE),A!K9,B!K9,'C'!K9:K13)","v":0}]
[null,"Odvelený:",null,{"$f":"CHOOSE(VLOOKUP($M$3,$O$3:$P$5,2,FALSE),A!D10,B!D10,'C'!D10:D14)","v":0},{"$f":"CHOOSE(VLOOKUP($M$3,$O$3:$P$5,2,FALSE),A!E10,B!E10,'C'!E10:E14)","v":0},{"$f":"CHOOSE(VLOOKUP($M$3,$O$3:$P$5,2,FALSE),A!F10,B!F10,'C'!F10:F14)","v":0},{"$f":"CHOOSE(VLOOKUP($M$3,$O$3:$P$5,2,FALSE),A!G10,B!G10,'C'!G10:G14)","v":0},{"$f":"CHOOSE(VLOOKUP($M$3,$O$3:$P$5,2,FALSE),A!H10,B!H10,'C'!H10:H14)","v":0},{"$f":"CHOOSE(VLOOKUP($M$3,$O$3:$P$5,2,FALSE),A!I10,B!I10,'C'!I10:I14)","v":0},{"$f":"CHOOSE(VLOOKUP($M$3,$O$3:$P$5,2,FALSE),A!J10,B!J10,'C'!J10:J14)","v":0},{"$f":"CHOOSE(VLOOKUP($M$3,$O$3:$P$5,2,FALSE),A!K10,B!K10,'C'!K10:K14)","v":0}]
[null,"Školenie:",null,{"$f":"CHOOSE(VLOOKUP($M$3,$O$3:$P$5,2,FALSE),A!D11,B!D11,'C'!D11:D15)","v":0},{"$f":"CHOOSE(VLOOKUP($M$3,$O$3:$P$5,2,FALSE),A!E11,B!E11,'C'!E11:E15)","v":0},{"$f":"CHOOSE(VLOOKUP($M$3,$O$3:$P$5,2,FALSE),A!F11,B!F11,'C'!F11:F15)","v":0},{"$f":"CHOOSE(VLOOKUP($M$3,$O$3:$P$5,2,FALSE),A!G11,B!G11,'C'!G11:G15)","v":0},{"$f":"CHOOSE(VLOOKUP($M$3,$O$3:$P$5,2,FALSE),A!H11,B!H11,'C'!H11:H15)","v":0},{"$f":"CHOOSE(VLOOKUP($M$3,$O$3:$P$5,2,FALSE),A!I11,B!I11,'C'!I11:I15)","v":0},{"$f":"CHOOSE(VLOOKUP($M$3,$O$3:$P$5,2,FALSE),A!J11,B!J11,'C'!J11:J15)","v":0},{"$f":"CHOOSE(VLOOKUP($M$3,$O$3:$P$5,2,FALSE),A!K11,B!K11,'C'!K11:K15)","v":0}]
[null,"NV:",null,{"$f":"CHOOSE(VLOOKUP($M$3,$O$3:$P$5,2,FALSE),A!D12,B!D12,'C'!D12:D16)","v":0},{"$f":"CHOOSE(VLOOKUP($M$3,$O$3:$P$5,2,FALSE),A!E12,B!E12,'C'!E12:E16)","v":0},{"$f":"CHOOSE(VLOOKUP($M$3,$O$3:$P$5,2,FALSE),A!F12,B!F12,'C'!F12:F16)","v":0},{"$f":"CHOOSE(VLOOKUP($M$3,$O$3:$P$5,2,FALSE),A!G12,B!G12,'C'!G12:G16)","v":0},{"$f":"CHOOSE(VLOOKUP($M$3,$O$3:$P$5,2,FALSE),A!H12,B!H12,'C'!H12:H16)","v":0},{"$f":"CHOOSE(VLOOKUP($M$3,$O$3:$P$5,2,FALSE),A!I12,B!I12,'C'!I12:I16)","v":0},{"$f":"CHOOSE(VLOOKUP($M$3,$O$3:$P$5,2,FALSE),A!J12,B!J12,'C'!J12:J16)","v":0},{"$f":"CHOOSE(VLOOKUP($M$3,$O$3:$P$5,2,FALSE),A!K12,B!K12,'C'!K12:K16)","v":0}]
[null,"VSČ:",null,{"$f":"CHOOSE(VLOOKUP($M$3,$O$3:$P$5,2,FALSE),A!D13,B!D13,'C'!D13:D17)","v":0},{"$f":"CHOOSE(VLOOKUP($M$3,$O$3:$P$5,2,FALSE),A!E13,B!E13,'C'!E13:E17)","v":0},{"$f":"CHOOSE(VLOOKUP($M$3,$O$3:$P$5,2,FALSE),A!F13,B!F13,'C'!F13:F17)","v":0},{"$f":"CHOOSE(VLOOKUP($M$3,$O$3:$P$5,2,FALSE),A!G13,B!G13,'C'!G13:G17)","v":0},{"$f":"CHOOSE(VLOOKUP($M$3,$O$3:$P$5,2,FALSE),A!H13,B!H13,'C'!H13:H17)","v":0},{"$f":"CHOOSE(VLOOKUP($M$3,$O$3:$P$5,2,FALSE),A!I13,B!I13,'C'!I13:I17)","v":0},{"$f":"CHOOSE(VLOOKUP($M$3,$O$3:$P$5,2,FALSE),A!J13,B!J13,'C'!J13:J17)","v":0},{"$f":"CHOOSE(VLOOKUP($M$3,$O$3:$P$5,2,FALSE),A!K13,B!K13,'C'!K13:K17)","v":0}]
[null,"Pohotovosť:",null,{"$f":"CHOOSE(VLOOKUP($M$3,$O$3:$P$5,2,FALSE),A!D14,B!D14,'C'!D14:D18)","v":0},{"$f":"CHOOSE(VLOOKUP($M$3,$O$3:$P$5,2,FALSE),A!E14,B!E14,'C'!E14:E18)","v":0},{"$f":"CHOOSE(VLOOKUP($M$3,$O$3:$P$5,2,FALSE),A!F14,B!F14,'C'!F14:F18)","v":0},{"$f":"CHOOSE(VLOOKUP($M$3,$O$3:$P$5,2,FALSE),A!G14,B!G14,'C'!G14:G18)","v":0},{"$f":"CHOOSE(VLOOKUP($M$3,$O$3:$P$5,2,FALSE),A!H14,B!H14,'C'!H14:H18)","v":0},{"$f":"CHOOSE(VLOOKUP($M$3,$O$3:$P$5,2,FALSE),A!I14,B!I14,'C'!I14:I18)","v":0},{"$f":"CHOOSE(VLOOKUP($M$3,$O$3:$P$5,2,FALSE),A!J14,B!J14,'C'!J14:J18)","v":0},{"$f":"CHOOSE(VLOOKUP($M$3,$O$3:$P$5,2,FALSE),A!K14,B!K14,'C'!K14:K18)","v":0}]
[null,"iné:",null,{"$f":"CHOOSE(VLOOKUP($M$3,$O$3:$P$5,2,FALSE),A!D15,B!D15,'C'!D15:D19)","v":0},{"$f":"CHOOSE(VLOOKUP($M$3,$O$3:$P$5,2,FALSE),A!E15,B!E15,'C'!E15:E19)","v":0},{"$f":"CHOOSE(VLOOKUP($M$3,$O$3:$P$5,2,FALSE),A!F15,B!F15,'C'!F15:F19)","v":0},{"$f":"CHOOSE(VLOOKUP($M$3,$O$3:$P$5,2,FALSE),A!G15,B!G15,'C'!G15:G19)","v":0},{"$f":"CHOOSE(VLOOKUP($M$3,$O$3:$P$5,2,FALSE),A!H15,B!H15,'C'!H15:H19)","v":0},{"$f":"CHOOSE(VLOOKUP($M$3,$O$3:$P$5,2,FALSE),A!I15,B!I15,'C'!I15:I19)","v":0},{"$f":"CHOOSE(VLOOKUP($M$3,$O$3:$P$5,2,FALSE),A!J15,B!J15,'C'!J15:J19)","v":0},{"$f":"CHOOSE(VLOOKUP($M$3,$O$3:$P$5,2,FALSE),A!K15,B!K15,'C'!K15:K19)","v":0}]
[null,"                      Obsadenie vozidiel:"]
[]
[null,"Vozidlo:",{"$f":"CHOOSE(VLOOKUP($M$3,$O$3:$P$5,2,FALSE),A!C18,B!C18,'C'!C18:C22)","v":1},{"$f":"CHOOSE(VLOOKUP($M$3,$O$3:$P$5,2,FALSE),A!D18,B!D18,'C'!D18:D22)","v":0},{"$f":"CHOOSE(VLOOKUP($M$3,$O$3:$P$5,2,FALSE),A!E18,B!E18,'C'!E18:E22)","v":0},{"$f":"CHOOSE(VLOOKUP($M$3,$O$3:$P$5,2,FALSE),A!F18,B!F18,'C'!F18:F22)","v":2},{"$f":"CHOOSE(VLOOKUP($M$3,$O$3:$P$5,2,FALSE),A!G18,B!G18,'C'!G18:G22)","v":0},{"$f":"CHOOSE(VLOOKUP($M$3,$O$3:$P$5,2,FALSE),A!H18,B!H18,'C'!H18:H22)","v":0},{"$f":"CHOOSE(VLOOKUP($M$3,$O$3:$P$5,2,FALSE),A!I18,B!I18,'C'!I18:I22)","v":3},{"$f":"CHOOSE(VLOOKUP($M$3,$O$3:$P$5,2,FALSE),A!J18,B!J18,'C'!J18:J22)","v":0},{"$f":"CHOOSE(VLOOKUP($M$3,$O$3:$P$5,2,FALSE),A!K18,B!K18,'C'!K18:K22)","v":0}]
[null,null,{"$f":"CHOOSE(VLOOKUP($M$3,$O$3:$P$5,2,FALSE),A!C19,B!C19,'C'!C19:C23)","v":0},{"$f":"CHOOSE(VLOOKUP($M$3,$O$3:$P$5,2,FALSE),A!D19,B!D19,'C'!D19:D23)","v":0},{"$f":"CHOOSE(VLOOKUP($M$3,$O$3:$P$5,2,FALSE),A!E19,B!E19,'C'!E19:E23)","v":0},{"$f":"CHOOSE(VLOOKUP($M$3,$O$3:$P$5,2,FALSE),A!F19,B!F19,'C'!F19:F23)","v":0},{"$f":"CHOOSE(VLOOKUP($M$3,$O$3:$P$5,2,FALSE),A!G19,B!G19,'C'!G19:G23)","v":0},{"$f":"CHOOSE(VLOOKUP($M$3,$O$3:$P$5,2,FALSE),A!H19,B!H19,'C'!H19:H23)","v":0},{"$f":"CHOOSE(VLOOKUP($M$3,$O$3:$P$5,2,FALSE),A!I19,B!I19,'C'!I19:I23)","v":0},{"$f":"CHOOSE(VLOOKUP($M$3,$O$3:$P$5,2,FALSE),A!J19,B!J19,'C'!J19:J23)","v":0},{"$f":"CHOOSE(VLOOKUP($M$3,$O$3:$P$5,2,FALSE),A!K19,B!K19,'C'!K19:K23)","v":0}]
[null,"Veliteľ:",{"$f":"CHOOSE(VLOOKUP($M$3,$O$3:$P$5,2,FALSE),A!C20,B!C20,'C'!C20:C24)","v":"H"},{"$f":"CHOOSE(VLOOKUP($M$3,$O$3:$P$5,2,FALSE),A!D20,B!D20,'C'!D20:D24)","v":0},{"$f":"CHOOSE(VLOOKUP($M$3,$O$3:$P$5,2,FALSE),A!E20,B!E20,'C'!E20:E24)","v":0},{"$f":"CHOOSE(VLOOKUP($M$3,$O$3:$P$5,2,FALSE),A!F20,B!F20,'C'!F20:F24)","v":"I"},{"$f":"CHOOSE(VLOOKUP($M$3,$O$3:$P$5,2,FALSE),A!G20,B!G20,'C'!G20:G24)","v":0},{"$f":"CHOOSE(VLOOKUP($M$3,$O$3:$P$5,2,FALSE),A!H20,B!H20,'C'!H20:H24)","v":0},{"$f":"CHOOSE(VLOOKUP($M$3,$O$3:$P$5,2,FALSE),A!I20,B!I20,'C'!I20:I24)","v":"-"},{"$f":"CHOOSE(VLOOKUP($M$3,$O$3:$P$5,2,FALSE),A!J20,B!J20,'C'!J20:J24)","v":0},{"$f":"CHOOSE(VLOOKUP($M$3,$O$3:$P$5,2,FALSE),A!K20,B!K20,'C'!K20:K24)","v":0}]
{"$rows_left_out":25}
{"sheet":"A","index":2,"n_rows":44,"n_cols":11,"rows_kept":44,"cut":false,"hidden":false,"merged":[[5,1,5,2],[5,3,5,10],[6,1,6,2],[6,3,6,4],[6,5,6,6],[6,7,6,8],[6,9,6,10],[1,1,1,10],[2,1,4,1],[2,2,4,3],[2,4,4,6],[2,7,2,9],[3,7,4,8],[7,1,7,2],[7,3,7,4],[7,5,7,6],[7,7,7,8],[7,9,7,10],[8,1,8,2],[8,3,8,4],[8,5,8,6],[8,7,8,8],[8,9,8,10],[9,1,9,2],[9,3,9,4],[9,5,9,6],[9,7,9,8],[9,9,9,10],[10,1,10,2],[10,3,10,4],[10,5,10,6],[10,7,10,8],[10,9,10,10],[13,1,13,2],[13,3,13,4],[13,5,13,6],[13,7,13,8],[13,9,13,10],[14,1,14,2],[14,3,14,10],[11,1,11,2],[11,3,11,4],[11,5,11,6],[11,7,11,8],[11,9,11,10],[12,1,12,2],[12,3,12,4],[12,5,12,6],[12,7,12,8],[12,9,12,10],[21,1,22,1],[21,2,22,4],[21,5,22,7],[21,8,22,10],[23,1,24,1],[23,2,24,4],[23,5,24,7],[23,8,24,10],[15,1,16,10],[17,1,18,1],[17,2,18,4],[17,5,18,7],[17,8,18,10],[19,1,20,1],[19,2,20,4],[19,5,20,7],[19,8,20,10],[25,1,26,1],[25,2,26,4],[25,5,26,7],[25,8,26,10],[26,12,26,17],[27,1,28,1],[27,2,28,4],[27,5,28,7],[27,8,28,10],[34,1,35,1],[34,2,35,4],[34,5,35,7],[34,8,35,10],[36,1,37,1],[36,2,37,4],[36,5,37,7],[36,8,37,10],[29,1,30,1],[29,2,30,4],[29,5,30,7],[29,8,30,10],[31,1,31,10],[32,1,33,1],[32,2,33,4],[32,5,33,7],[32,8,33,10],[38,1,39,1],[38,2,39,4],[38,5,39,7],[38,8,39,10],[39,12,39,17],[40,1,41,1],[40,2,41,4],[40,5,41,7],[40,8,41,10],[50,1,50,4],[51,1,51,4],[52,1,52,4],[53,1,53,4],[54,1,54,4],[55,1,55,4],[43,4,43,5],[43,6,43,9],[45,12,45,17],[47,1,47,4],[48,1,48,4],[49,1,49,4],[68,1,68,4],[69,1,69,4],[62,1,62,4],[63,1,63,4],[64,1,64,4],[65,1,65,4],[66,1,66,4],[67,1,67,4],[56,1,56,4],[57,1,57,4],[58,1,58,4],[59,1,59,4],[60,1,60,4],[61,1,61,4]]}
[]
[null,"Rozdelenie "]
[null,"Dátum:",{"$f":"TODAY()","v":"2016-01-01"},null,null,null,null,"zmena:",null,null,"A"]
[null,null,null,null,null,null,null,"Stav družstva",null,"celkový:",12]
[null,null,null,null,null,null,null,null,null,"skutočný:",8]
[null,"Poznámka:"]
[null,"Spojovacia služba:",null,"d"]
[null,"Dovolenka:"]
[null,"PN (OČR):"]
[null,"Odvelený:"]
[null,"Školenie:"]
[null,"NV:"]
[null,"VSČ:"]
[null,"Pohotovosť:"]
[null,"iné:"]
[null,"                      Obsadenie vozidiel:"]
[]
[null,"Vozidlo:",1,null,null,2,null,null,3]
[]
[null,"Veliteľ:","A",null,null,"B",null,null,"-"]
{"$rows_left_out":25}
{"sheet":"B","index":3,"n_rows":44,"n_cols":11,"rows_kept":44,"cut":false,"hidden":false,"merged":[[5,1,5,2],[5,3,5,10],[6,1,6,2],[6,3,6,4],[6,5,6,6],[6,7,6,8],[6,9,6,10],[1,1,1,10],[1,12,1,17],[2,1,4,1],[2,2,4,3],[2,4,4,6],[2,7,2,9],[2,12,2,17],[3,7,4,8],[7,1,7,2],[7,3,7,4],[7,5,7,6],[7,7,7,8],[7,9,7,10],[8,1,8,2],[8,3,8,4],[8,5,8,6],[8,7,8,8],[8,9,8,10],[9,1,9,2],[9,3,9,4],[9,5,9,6],[9,7,9,8],[9,9,9,10],[10,1,10,2],[10,3,10,4],[10,5,10,6],[10,7,10,8],[10,9,10,10],[13,1,13,2],[13,3,13,4],[13,5,13,6],[13,7,13,8],[13,9,13,10],[14,1,14,2],[14,3,14,10],[11,1,11,2],[11,3,11,4],[11,5,11,6],[11,7,11,8],[11,9,11,10],[12,1,12,2],[12,3,12,4],[12,5,12,6],[12,7,12,8],[12,9,12,10],[21,1,22,1],[21,2,22,4],[21,5,22,7],[21,8,22,10],[23,1,24,1],[23,2,24,4],[23,5,24,7],[23,8,24,10],[15,1,16,10],[17,1,18,1],[17,2,18,4],[17,5,18,7],[17,8,18,10],[19,1,20,1],[19,2,20,4],[19,5,20,7],[19,8,20,10],[25,1,26,1],[25,2,26,4],[25,5,26,7],[25,8,26,10],[26,12,26,17],[27,1,28,1],[27,2,28,4],[27,5,28,7],[27,8,28,10],[34,1,35,1],[34,2,35,4],[34,5,35,7],[34,8,35,10],[36,1,37,1],[36,2,37,4],[36,5,37,7],[36,8,37,10],[29,1,30,1],[29,2,30,4],[29,5,30,7],[29,8,30,10],[31,1,31,10],[32,1,33,1],[32,2,33,4],[32,5,33,7],[32,8,33,10],[38,1,39,1],[38,2,39,4],[38,5,39,7],[38,8,39,10],[39,12,39,17],[40,1,41,1],[40,2,41,4],[40,5,41,7],[40,8,41,10],[50,1,50,4],[51,1,51,4],[52,1,52,4],[53,1,53,4],[54,1,54,4],[55,1,55,4],[43,4,43,5],[43,6,43,9],[45,12,45,17],[47,1,47,4],[48,1,48,4],[49,1,49,4],[68,1,68,4],[69,1,69,4],[62,1,62,4],[63,1,63,4],[64,1,64,4],[65,1,65,4],[66,1,66,4],[67,1,67,4],[56,1,56,4],[57,1,57,4],[58,1,58,4],[59,1,59,4],[60,1,60,4],[61,1,61,4]]}
[]
[null,"Rozdelenie "]
[null,"Dátum:",{"$f":"TODAY()","v":"2016-01-01"},null,null,null,null,"zmena:",null,null,"B"]
[null,null,null,null,null,null,null,"Stav družstva",null,"celkový:",13]
[null,null,null,null,null,null,null,null,null,"skutočný:",12]
[null,"Poznámka:"]
[null,"Spojovacia služba:",null,"n"]
[null,"Dovolenka:"]
[null,"PN (OČR):"]
[null,"Odvelený:"]
[null,"Školenie:"]
[null,"NV:"]
[null,"VSČ:"]
[null,"Pohotovosť:"]
[null,"iné:"]
[null,"                      Obsadenie vozidiel:"]
[]
[null,"Vozidlo:",1,null,null,2,null,null,3]
[]
[null,"Veliteľ:","H",null,null,"I",null,null,"-"]
{"$rows_left_out":25}
{"sheet":"C","index":4,"n_rows":44,"n_cols":11,"rows_kept":44,"cut":false,"hidden":false,"merged":[[5,1,5,2],[5,3,5,10],[6,1,6,2],[6,3,6,4],[6,5,6,6],[6,7,6,8],[6,9,6,10],[1,1,1,10],[1,12,1,17],[2,1,4,1],[2,2,4,3],[2,4,4,6],[2,7,2,9],[2,12,2,17],[3,7,4,8],[7,1,7,2],[7,3,7,4],[7,5,7,6],[7,7,7,8],[7,9,7,10],[8,1,8,2],[8,3,8,4],[8,5,8,6],[8,7,8,8],[8,9,8,10],[9,1,9,2],[9,3,9,4],[9,5,9,6],[9,7,9,8],[9,9,9,10],[10,1,10,2],[10,3,10,4],[10,5,10,6],[10,7,10,8],[10,9,10,10],[13,1,13,2],[13,3,13,4],[13,5,13,6],[13,7,13,8],[13,9,13,10],[14,1,14,2],[14,3,14,10],[11,1,11,2],[11,3,11,4],[11,5,11,6],[11,7,11,8],[11,9,11,10],[12,1,12,2],[12,3,12,4],[12,5,12,6],[12,7,12,8],[12,9,12,10],[21,1,22,1],[21,2,22,4],[21,5,22,7],[21,8,22,10],[23,1,24,1],[23,2,24,4],[23,5,24,7],[23,8,24,10],[15,1,16,10],[17,1,18,1],[17,2,18,4],[17,5,18,7],[17,8,18,10],[19,1,20,1],[19,2,20,4],[19,5,20,7],[19,8,20,10],[25,1,26,1],[25,2,26,4],[25,5,26,7],[25,8,26,10],[26,12,26,17],[27,1,28,1],[27,2,28,4],[27,5,28,7],[27,8,28,10],[34,1,35,1],[34,2,35,4],[34,5,35,7],[34,8,35,10],[36,1,37,1],[36,2,37,4],[36,5,37,7],[36,8,37,10],[29,1,30,1],[29,2,30,4],[29,5,30,7],[29,8,30,10],[31,1,31,10],[32,1,33,1],[32,2,33,4],[32,5,33,7],[32,8,33,10],[38,1,39,1],[38,2,39,4],[38,5,39,7],[38,8,39,10],[39,12,39,17],[40,1,41,1],[40,2,41,4],[40,5,41,7],[40,8,41,10],[50,1,50,4],[51,1,51,4],[52,1,52,4],[53,1,53,4],[54,1,54,4],[55,1,55,4],[43,4,43,5],[43,6,43,9],[45,12,45,17],[47,1,47,4],[48,1,48,4],[49,1,49,4],[68,1,68,4],[69,1,69,4],[62,1,62,4],[63,1,63,4],[64,1,64,4],[65,1,65,4],[66,1,66,4],[67,1,67,4],[56,1,56,4],[57,1,57,4],[58,1,58,4],[59,1,59,4],[60,1,60,4],[61,1,61,4]]}
[]
[null,"Rozdelenie "]
[null,"Dátum:",{"$f":"TODAY()","v":"2016-01-01"},null,null,null,null,"zmena:",null,null,"C"]
[null,null,null,null,null,null,null,"Stav družstva",null,"celkový:",12]
[null,null,null,null,null,null,null,null,null,"skutočný:",8]
[null,"Poznámka:"]
[null,"Spojovacia služba:",null,"v"]
[null,"Dovolenka:"]
[null,"PN (OČR):"]
[null,"Odvelený:"]
[null,"Školenie:"]
[null,"NV:"]
[null,"VSČ:"]
[null,"Pohotovosť:"]
[null,"iné:"]
[null,"                      Obsadenie vozidiel:"]
[]
[null,"Vozidlo:",1,null,null,2,null,null,3]
[]
[null,"Veliteľ:","O",null,null,"P",null,null,"-"]
{"$rows_left_out":25}
{"sheet":"www","index":5,"n_rows":109,"n_cols":7,"rows_kept":109,"cut":false,"hidden":false,"merged":[]}
["fav_j4wjust4web.cz","fav_etrEtřídnice.cz","fav_ssSeznamŠkol.eu","fav_zsZoznamŠkôl.eu","fav_joJaknaOffice.cz","fav_ohOnline hry","Více"]
["fav_knKam-na.cz","fav_sszSpis szkół v PL","fav_peHR magazín","fav_ucCeloživotní učení","Mateřské školky","Zábavný portál","BMI"]
["Mzdová kalkulačka","Výpočet nemocenské","Výpočet mateřské","Kalkulačky","Referáty","SuperMamina"]
["WWW pro Ĺˇkoly"]
["Jak na Office - tutoriály, video návody"]
["Prohlášení serveru | Spolupráce s námi"]
[]
[]
["Word"]
["Excel"]
["PowerPoint"]
["Access"]
["Outlook"]
["ECDL"]
["Poradna Office"]
["MS Word"]
["MS Excel"]
["MS Access"]
["MS Powerpoint"]
["MS Outlook"]
{"$rows_left_out":89}